program: Gaussian 09
title: 000295301
version: EM64L-G09RevD.01
frameworkgroup: C1[X(C17H18ClNO2)]
method: RPBEPBE
basis: SDD
operation: Freq
keyword: #p
keyword: freq=noraman
keyword: PBEPBE/SDD
title: #p freq=noraman PBEPBE/SDD
converged: YES YES NO NO
title: Mulliken charges:
elementType: Cl O O N C C C C C C C C C C C C C C C C C H H H H H H H H H H H H H H H H H H
charge: -0.070088 -0.238559 -0.226674 -0.252164 0.250074 -0.342344 0.341639 0.110665 -0.349093 -0.397821 -0.674908 -0.375551 -0.809972 -0.244743 -0.233976 0.348238 -0.316205 -0.360297 -0.212358 -0.186433 -0.115325 0.213215 0.256668 0.260705 0.248069 0.236808 0.248363 0.220110 0.220779 0.238149 0.246219 0.238517 0.230421 0.235813 0.233187 0.255790 0.265385 0.251339 0.256358
chargesum: 0.00000
title: Mulliken charges with hydrogens summed into heavy atoms:
elementType: Cl O O N C C C C C C C C C C C C C C C C C
charge: -0.070088 -0.238559 -0.226674 -0.252164 0.250074 0.127539 0.341639 0.110665 -0.088388 0.087056 0.014344 -0.137402 -0.094815 -0.008929 -0.000789 0.348238 -0.060415 -0.094912 0.038981 0.069925 -0.115325
polarizability: 2.45079249e+02 -1.07793153e+00 2.19531012e+02 2.00523571e+00 -1.27323486e+01 1.48622238e+02
1716.lowfreq: -4.4221 0.0003 0.0014 0.0017 3.0316 10.4301 18.0415 18.7703 33.3049
frequency: 17.8949 18.5824 33.2722 36.0459 41.9271 65.5650 84.3350 99.9235 106.7356 133.1589 147.4377 164.0113 181.2780 214.9710 234.3914 253.3240 276.0218 314.9377 323.9370 344.9996 376.3398 393.1057 417.2189 420.0035 462.7273 481.8896 496.2147 500.0046 546.2662 571.2355 598.7397 613.3284 623.9423 651.3745 697.6696 725.3163 732.1468 768.1969 779.8112 791.7033 801.9101 824.8871 827.6548 877.1944 909.0717 926.7534 938.0709 955.2036 955.7530 981.4010 990.5083 991.8411 994.3678 1010.2096 1041.3572 1043.6571 1063.5434 1071.4801 1091.1076 1108.4474 1110.2159 1139.9471 1173.5729 1176.1816 1204.6367 1211.6380 1224.1379 1256.1048 1262.7077 1280.0137 1291.1866 1338.9758 1355.7739 1364.4044 1370.6504 1383.2565 1386.0906 1401.7620 1405.7803 1433.1562 1447.0720 1451.5242 1463.6146 1471.4445 1475.5504 1477.1704 1482.1667 1486.4204 1582.6142 1583.7993 1604.8985 1606.0383 1619.8259 2949.5729 2978.1019 2986.3276 3010.1252 3012.3641 3058.6938 3071.7966 3084.3272 3094.8308 3102.4051 3124.2335 3131.9474 3146.1081 3154.0320 3161.8701 3165.5577 3173.4050 3181.5842
redmass: 3.8439 5.2600 2.9578 5.1536 3.9825 7.2251 4.6861 3.1803 1.1921 8.3624 2.8029 3.2639 3.5741 2.3136 2.0334 3.1867 3.1568 6.6510 3.5854 3.2271 5.7721 5.2832 3.0214 4.2885 3.1630 4.2445 3.8161 2.9288 5.0042 3.6463 4.1018 5.8871 7.1484 5.8609 3.4906 3.3630 2.5858 1.3976 1.8523 3.0402 1.3094 1.9566 2.7677 1.3042 2.7474 1.3441 3.0190 1.3901 1.3421 1.6099 3.7505 1.3398 1.9048 5.3979 2.1486 1.5710 3.8102 2.5327 2.0043 1.5708 1.5121 1.6572 1.0625 1.1650 2.4576 1.1090 3.9724 1.7754 3.0164 1.5213 1.2686 1.4415 1.4692 4.2661 4.5449 1.8182 1.5162 1.2294 3.7792 2.0518 1.1264 1.1514 1.0910 1.0440 1.5539 1.6942 1.0715 1.9185 6.4327 7.1034 6.6951 6.7555 8.1145 1.0556 1.0403 1.0353 1.1034 1.0604 1.0928 1.1018 1.0992 1.1001 1.1031 1.0866 1.0890 1.0942 1.0879 1.0886 1.1008 1.0967 1.0978
irintensity: 0.0119 0.1359 0.0493 0.5782 0.2485 1.2490 0.5727 0.2958 0.8662 0.1924 8.8135 2.2256 0.4473 1.8261 0.5086 1.0595 8.0755 2.1059 1.6459 1.8742 15.0293 8.6329 0.1773 2.6822 5.9770 1.1345 2.2616 21.6137 3.3276 3.0745 6.9227 18.3935 0.9819 18.1571 0.4613 17.2393 13.3424 69.1560 5.0797 2.6024 17.6756 49.0474 26.5057 0.4044 25.4957 0.0071 2.5404 0.2510 0.2895 2.2201 30.6221 0.2564 1.1645 66.2868 10.4315 15.0474 10.8767 35.7597 17.9168 42.4832 5.2416 36.5784 0.4264 45.7733 5.2557 10.4612 364.6436 16.9952 106.1796 4.7930 0.1585 4.6117 0.6894 23.0638 36.0809 30.6025 26.6819 18.1376 0.3685 9.2922 41.6327 52.8981 12.9819 13.4778 61.8453 136.3002 18.0250 55.2925 21.7777 9.8947 66.8129 23.4396 210.0119 50.1128 19.4643 24.6068 15.8598 31.9147 17.4505 4.3168 37.8121 15.7376 25.9990 6.6959 3.7236 23.3837 10.6923 2.0185 19.5549 7.2449 1.1459
temp: 298.150 k
press: 1.00000 atm
elementType: 17 8 8 7 6 6 6 6 6 6 6 6 6 6 6 6 6 6 6 6 6 1 1 1 1 1 1 1 1 1 1 1 1 1 1 1 1 1 1
symmnumber: 1
zpe: 808998.7 jmol-1
zpe.correction: 0.308131 hartree
zpe.thermalcorrener: 0.328945 hartree
zpe.thermalcorrenthalpy: 0.329889 hartree
zpe.thermalcorrgfe: 0.254711 hartree
zpe.sumelectzpe: -1322.335203 hartree
zpe.sumelectthermal: -1322.314389 hartree
zpe.sumelectthermalent: -1322.313445 hartree
zpe.sumelectthermalfe: -1322.388624 hartree
dipole: 5.1298 3.9436 0.0616
dipole: 6.4708
quadrupole: -135.2872 -133.1757 -125.1690
quadrupole: 8.3412 1.3406 -1.9011
quadrupole: -4.0766 -1.9651 6.0416 8.3412 1.3406 -1.9011
hfenergy: -1322.6433342 hartree
pointgroup: C01 [X(C17H18Cl1N1O2)]
dipole: -2.0753027 -1.4733232 0.0589951 debye
polarizability: 244.2258445|-0.5642735|217.2027159|-8.4678361|18.2907134|151.8039387 unknown
InChI: InChI=1S/C17H18ClNO2/c1-3-19(16-7-5-4-6-13(16)2)17(20)12-21-15-10-8-14(18)9-11-15/h4-11H,3,12H2,1-2H3
charge 0 multiplicity 1
39 atoms
Cl 6.769666 -1.17793 -0.699019
O  1.382394 1.377054 0.207099
O  -0.871121 2.890232 0.232863
N  -2.269013 1.025141 0.271144
C  -2.482572 -0.392628 0.060445
C  -3.456841 1.890382 0.514299
C  -2.689761 -1.258454 1.175868
C  -1.019921 1.640466 0.139613
C  -2.507498 -0.900614 -1.262412
C  0.151214 0.671408 -0.122514
C  -4.116664 2.375034 -0.792213
C  -2.912092 -2.634536 0.914167
C  -2.672232 -0.733618 2.599116
C  -2.72865 -2.274482 -1.499282
C  -2.933049 -3.143894 -0.403613
C  2.588188 0.703347 -0.037864
C  2.693674 -0.620008 -0.536344
C  3.757373 1.449604 0.257571
C  3.972648 -1.191524 -0.737574
C  5.028796 0.880307 0.058199
C  5.11955 -0.437448 -0.438925
H  -4.175386 1.310936 1.121428
H  -3.112041 2.757702 1.103193
H  -2.363218 -0.20674 -2.098551
H  0.046692 -0.245097 0.492457
H  0.15152 0.367901 -1.190652
H  -3.406313 2.985884 -1.374989
H  -4.452648 1.524994 -1.413044
H  -4.998975 3.000021 -0.561913
H  -3.065436 -3.315066 1.76027
H  -1.938572 0.081801 2.722822
H  -3.658998 -0.321393 2.887452
H  -2.430962 -1.537043 3.31559
H  -2.747824 -2.659046 -2.524569
H  -3.106336 -4.212175 -0.573514
H  1.807409 -1.217939 -0.767125
H  3.646848 2.469128 0.637537
H  4.064653 -2.211816 -1.121075
H  5.9334 1.451907 0.283858
