program: Gaussian 09
title: 000295291
version: EM64L-G09RevD.01
frameworkgroup: C1[X(C15H15ClN2O2)]
method: RPBEPBE
basis: SDD
operation: Freq
keyword: #p
keyword: freq=noraman
keyword: PBEPBE/SDD
title: #p freq=noraman PBEPBE/SDD
converged: YES YES NO NO
title: Mulliken charges:
elementType: Cl O O N N C C C C C C C C C C C C C C C H H H H H H H H H H H H H H H
charge: -0.074209 -0.334178 -0.286453 -0.495714 -0.507039 0.281488 0.198288 -0.311995 -0.326842 0.508391 0.264512 -0.234804 -0.253171 -0.232207 -0.445341 -0.347833 -0.038914 -0.191505 -0.689307 -0.264689 0.331331 0.306639 0.243947 0.227240 0.225481 0.296710 0.214650 0.214640 0.244735 0.312233 0.231190 0.217417 0.229406 0.229401 0.256502
chargesum: 0.00000
title: Mulliken charges with hydrogens summed into heavy atoms:
elementType: Cl O O N N C C C C C C C C C C C C C C C
charge: -0.074209 -0.334178 -0.286453 -0.164383 -0.210329 0.281488 0.198288 -0.005356 -0.082895 0.508391 0.264512 -0.007564 -0.027690 0.197083 -0.200606 -0.035599 -0.038914 0.039685 -0.013084 -0.008187
polarizability: 3.30749008e+02 -1.56441272e+01 2.22419162e+02 -3.50709606e-02 -7.57664212e-02 8.35564538e+01
1716.lowfreq: -0.0020 -0.0018 -0.0007 2.1953 2.8883 7.9083 18.1994 33.0818 46.4670
frequency: 18.1429 33.0099 46.4655 61.7017 76.0537 86.0295 108.5520 112.4596 161.5401 182.0203 198.2316 205.5731 231.8763 247.1805 258.4082 296.7576 306.2293 332.4625 364.0656 410.5824 436.4094 445.7873 477.7471 498.2823 517.0678 558.3702 577.2416 590.9520 632.0999 673.6040 679.5604 688.6973 703.7427 732.2955 751.4771 757.4182 777.6936 786.5087 819.2123 824.7463 854.8211 855.6809 890.9386 908.7392 909.2877 935.8712 977.1031 983.1315 991.1147 1008.2277 1040.1117 1042.2439 1072.3881 1096.7039 1106.3580 1116.6165 1139.0037 1173.4123 1176.8464 1185.9891 1190.8535 1250.4204 1261.4693 1262.1895 1303.1384 1312.2744 1363.6840 1368.3477 1394.3090 1401.2458 1413.2108 1440.8344 1464.1141 1472.9511 1475.0551 1481.8653 1494.4133 1509.9906 1524.0993 1584.5250 1605.9771 1611.6561 1615.6322 1649.9713 2964.3953 2996.4592 3023.3948 3094.3301 3103.8426 3136.8804 3142.1276 3145.9761 3153.5753 3169.6514 3180.7094 3197.1143 3201.3980 3483.2063 3529.2670
redmass: 5.5041 5.2205 5.6474 4.4256 5.5675 3.6901 4.8723 2.0976 7.5214 5.5242 4.6084 5.1459 3.3183 1.1802 6.6798 4.1212 8.2168 3.7717 6.1791 8.6223 2.8433 2.8335 5.1147 1.6003 7.1350 3.8727 3.7204 6.3835 6.7345 7.2741 1.7581 1.6987 4.6144 4.0646 1.2662 4.9473 6.1771 1.3079 5.9440 1.1071 1.6024 1.3521 5.9146 1.3652 3.2205 1.3461 5.8880 1.2938 1.3063 7.0120 2.9098 2.0850 1.9689 1.5789 2.2466 2.0949 1.4384 1.0659 1.1230 2.0600 2.9267 1.8811 1.1396 1.6817 1.5946 1.8591 1.8936 2.2956 2.3446 1.8055 3.7138 2.4924 1.0405 1.7002 2.5886 1.1948 1.2088 2.2110 2.5082 5.1771 5.7830 6.7629 6.2453 3.8488 1.0557 1.0361 1.1078 1.0988 1.1017 1.0857 1.0922 1.0891 1.0914 1.0980 1.0954 1.0950 1.0952 1.0762 1.0760
irintensity: 0.1290 0.1798 0.1741 0.2249 8.6221 1.5170 2.0798 4.7083 2.3223 1.3888 1.4113 4.9526 2.0274 1.0880 2.0655 0.7064 7.3020 2.4814 4.1486 6.4365 5.8873 5.5282 1.0857 16.0967 22.6950 2.8424 3.8641 4.7592 0.7516 14.6954 4.7578 80.7371 49.7936 12.8198 137.0634 15.6667 2.0051 54.2651 21.1003 0.7011 44.3218 9.7585 11.4555 4.5422 37.1256 7.2529 17.3632 2.8901 5.4094 34.9693 64.6292 35.5395 23.8455 18.9558 53.7088 35.6689 4.5150 8.1161 28.2444 253.0364 137.2901 83.0716 0.0660 94.2984 126.4362 10.6180 37.1254 170.3413 56.8662 38.7764 41.9816 237.7651 13.1473 71.4479 323.9047 3.6607 6.8528 808.1376 329.9530 166.4759 13.3343 172.9865 52.3807 90.4832 45.4576 18.6681 29.2222 30.4295 36.6059 0.7225 8.8303 8.9505 24.9654 21.2378 2.5507 7.4995 9.6067 76.8857 14.3444
temp: 298.150 k
press: 1.00000 atm
elementType: 17 8 8 7 7 6 6 6 6 6 6 6 6 6 6 6 6 6 6 6 1 1 1 1 1 1 1 1 1 1 1 1 1 1 1
symmnumber: 1
zpe: 712408.5 jmol-1
zpe.correction: 0.271342 hartree
zpe.thermalcorrener: 0.290105 hartree
zpe.thermalcorrenthalpy: 0.291050 hartree
zpe.thermalcorrgfe: 0.222006 hartree
zpe.sumelectzpe: -1299.190613 hartree
zpe.sumelectthermal: -1299.171850 hartree
zpe.sumelectthermalent: -1299.170905 hartree
zpe.sumelectthermalfe: -1299.239949 hartree
dipole: 4.0884 3.8028 0.0030
dipole: 5.5835
quadrupole: -115.3075 -113.6484 -130.7869
quadrupole: 17.8228 0.0044 0.0177
quadrupole: 4.6068 6.2658 -10.8726 17.8228 0.0044 0.0177
hfenergy: -1299.461955 hartree
pointgroup: C01 [X(C15H15Cl1N2O2)]
dipole: -1.6581141 1.438332 -0.0864419 debye
polarizability: 329.4615578|19.4513812|223.460059|4.2052925|-4.583703|83.8030068 unknown
InChI: InChI=1S/C15H15ClN2O2/c1-2-20-14-9-4-3-8-13(14)18-15(19)17-12-7-5-6-11(16)10-12/h3-10,17-18H,2H2,1H3
charge 0 multiplicity 1
35 atoms
Cl 6.187952 2.160729 -0.027535
O  -2.898124 1.651783 -0.192279
O  0.427607 -1.981046 -0.00214
N  -0.926912 -0.054388 -0.095183
N  1.38677 0.178915 -0.058934
C  -2.221154 -0.632251 -0.098725
C  -3.306453 0.29835 -0.151698
C  -2.502598 -2.017468 -0.055295
C  -4.641531 -0.146189 -0.161019
C  2.771124 -0.128772 -0.019238
C  0.300337 -0.722472 -0.049267
C  -3.846026 -2.459882 -0.064828
C  -4.910497 -1.536251 -0.117169
C  -3.944094 2.690671 -0.254574
C  3.672764 0.973132 -0.039027
C  3.283576 -1.45418 0.038134
C  5.053397 0.7267 -0.001062
C  4.67928 -1.65295 0.07476
C  -3.237782 4.042898 -0.295311
C  5.591558 -0.571924 0.056153
H  -0.954065 0.970045 -0.131101
H  -1.669793 -2.721389 -0.015164
H  -5.469655 0.567068 -0.201942
H  -4.053478 -3.534462 -0.031001
H  -5.948309 -1.885342 -0.124445
H  1.168944 1.176853 -0.098161
H  -4.560004 2.529318 -1.162247
H  -4.59546 2.602469 0.638297
H  3.301998 2.003176 -0.083098
H  2.588631 -2.294444 0.052854
H  5.068675 -2.675757 0.118918
H  -3.984766 4.855784 -0.342163
H  -2.621686 4.191729 0.608045
H  -2.587275 4.119793 -1.183387
H  6.672049 -0.733048 0.084835
