program: Gaussian 09
title: 000295293
version: EM64L-G09RevD.01
frameworkgroup: C1[X(C16H15ClN2O3)]
method: RPBEPBE
basis: SDD
operation: Freq
keyword: #p
keyword: freq=noraman
keyword: PBEPBE/SDD
title: #p freq=noraman PBEPBE/SDD
converged: YES YES NO NO
title: Mulliken charges:
elementType: Cl O O O N N C C C C C C C C C C C C C C C C H H H H H H H H H H H H H H H
charge: -0.060144 -0.288646 -0.278589 -0.264336 -0.501158 -0.504957 0.485798 0.237300 -0.449924 -0.320804 -0.336400 -0.339854 0.491922 0.276946 0.177449 -0.438885 -0.313684 -0.184475 -0.198703 -0.121549 -0.219384 -0.674478 0.219055 0.307627 0.270575 0.270149 0.292926 0.292652 0.221845 0.312248 0.255544 0.255389 0.228513 0.228537 0.211595 0.229953 0.229948
chargesum: 0.00000
title: Mulliken charges with hydrogens summed into heavy atoms:
elementType: Cl O O O N N C C C C C C C C C C C C C C C C
charge: -0.060144 -0.288646 -0.278589 -0.264336 -0.208232 -0.212306 0.485798 0.237300 -0.230869 -0.013178 -0.065825 -0.069705 0.491922 0.276946 0.177449 -0.217039 -0.001436 0.071069 0.056686 -0.121549 0.237666 -0.002981
polarizability: 4.35862713e+02 5.71437386e+00 2.04984729e+02 2.47548682e-02 -5.06446928e-02 8.86012202e+01
1716.lowfreq: -6.2205 -4.9258 -0.0026 -0.0025 -0.0020 0.5522 15.8692 19.7416 36.4851
frequency: 15.8290 19.7295 36.4579 37.4111 52.4971 71.3885 76.8436 86.4466 100.0764 135.2461 155.0242 158.5999 167.2359 233.6808 241.4160 277.0735 302.3916 304.0713 317.6233 350.0030 369.6766 378.2300 410.7915 412.8909 426.2820 452.2937 485.5136 508.2249 530.6381 601.1815 622.4147 622.6727 629.5139 677.8029 679.3126 697.6147 702.9099 757.5349 764.3290 783.9279 797.6587 804.8342 810.3373 837.4816 844.9039 847.1363 878.9055 880.2045 934.0073 979.4650 980.0403 991.8339 999.5140 1003.9242 1005.6519 1024.2107 1067.9353 1075.2608 1112.5058 1117.0111 1123.8993 1136.5042 1176.0257 1184.8231 1186.2713 1248.2375 1249.3754 1251.8499 1279.2890 1296.8252 1308.7479 1358.8993 1362.3573 1373.1202 1400.2658 1401.1853 1423.8120 1462.6962 1473.7746 1478.7408 1486.6785 1497.6341 1502.6519 1514.6646 1586.2161 1596.8569 1607.7951 1613.8359 1623.0321 1654.7212 2995.2806 3008.0614 3065.7962 3091.7930 3106.4116 3111.7681 3117.5541 3162.3893 3166.8108 3171.2126 3173.8846 3200.2823 3202.8264 3517.0970 3529.9637
redmass: 3.8989 7.6965 2.8003 6.5738 5.5499 5.6559 4.5145 5.0383 3.9377 4.7559 3.0373 7.4851 7.9268 6.1650 1.2899 7.1367 3.4713 6.4290 5.1264 4.4777 5.1954 7.6799 3.0209 2.9640 7.5957 1.6971 5.5781 2.7747 2.4418 7.4908 7.1279 1.1962 7.1596 7.3481 4.2140 7.3856 4.1467 4.4122 7.0605 6.4272 1.1020 5.2382 1.4035 1.4160 1.4046 4.2449 1.4953 5.7541 1.3564 1.3172 1.3578 4.6296 5.9477 3.3279 1.3308 2.3083 5.1288 2.5992 2.2079 1.3377 1.3432 1.4680 2.5097 1.1909 1.1196 1.1326 2.0650 3.2062 1.8117 1.4605 1.4984 1.5350 3.5907 5.2696 1.2723 4.3370 4.5266 1.0406 1.0586 2.4465 1.0770 2.0914 2.3666 2.6803 5.0970 5.6103 6.2269 10.4366 5.9108 3.9566 1.0358 1.0581 1.1065 1.0985 1.1025 1.0899 1.0902 1.0946 1.0912 1.0908 1.0950 1.0950 1.0951 1.0765 1.0757
irintensity: 2.1705 0.0319 0.6608 0.4024 0.0865 10.6244 0.9979 1.8690 3.9113 0.0243 1.2129 3.3734 2.5310 5.3610 0.4049 2.4110 2.2175 1.8073 0.8628 12.2836 4.9617 28.4652 0.0113 0.0108 9.8243 1.7385 1.3651 57.5520 1.1351 13.0307 0.4155 118.1291 0.3094 7.0499 36.5170 19.7731 0.8745 15.9787 6.5701 2.8132 2.0427 3.9069 40.6837 31.1954 58.1511 8.0986 56.6411 0.9128 1.1257 3.4384 0.0001 40.3471 2.7176 29.8372 1.2144 43.6731 511.3902 32.5988 2.9206 16.2513 14.3255 5.6158 474.2217 87.7323 8.9359 0.0015 105.4384 661.1808 47.8286 10.1113 76.8610 33.1741 25.0730 332.8966 21.5878 19.4170 16.8836 12.1083 9.3139 430.1070 15.2634 255.9697 1162.7833 4.6621 16.6817 35.9585 32.5240 303.2014 107.1487 106.4588 22.6596 25.9811 9.2485 35.2407 45.2661 20.5426 17.5626 4.4820 2.2426 0.8388 3.0052 10.9512 4.1124 5.3008 19.7686
temp: 298.150 k
press: 1.00000 atm
elementType: 17 8 8 8 7 7 6 6 6 6 6 6 6 6 6 6 6 6 6 6 6 6 1 1 1 1 1 1 1 1 1 1 1 1 1 1 1
symmnumber: 1
zpe: 736466.2 jmol-1
zpe.correction: 0.280505 hartree
zpe.thermalcorrener: 0.301400 hartree
zpe.thermalcorrenthalpy: 0.302344 hartree
zpe.thermalcorrgfe: 0.226841 hartree
zpe.sumelectzpe: -1412.403639 hartree
zpe.sumelectthermal: -1412.382744 hartree
zpe.sumelectthermalent: -1412.381800 hartree
zpe.sumelectthermalfe: -1412.457304 hartree
dipole: -0.0147 -2.9917 0.0007
dipole: 2.9917
quadrupole: -152.7250 -117.6985 -140.2405
quadrupole: -29.1332 0.0023 -0.0042
quadrupole: -15.8370 19.1895 -3.3525 -29.1332 0.0023 -0.0042
hfenergy: -1412.6841445 hartree
pointgroup: C01 [X(C16H15Cl1N2O3)]
dipole: -0.0050647 1.1770115 -0.000259 debye
polarizability: 435.8558386|-5.8516021|204.9916039|-0.024785|-0.05063|88.6012202 unknown
InChI: InChI=1S/C16H15ClN2O3/c1-2-22-15(20)11-3-7-13(8-4-11)18-16(21)19-14-9-5-12(17)6-10-14/h3-10,18-19H,2H2,1H3
charge 0 multiplicity 1
37 atoms
Cl 8.363095 -1.277735 -0.002152
O  -5.643596 -1.058642 -0.000213
O  1.360139 -0.96793 0.002038
O  -6.105239 1.227784 -0.001792
N  0.405238 1.191527 0.001024
N  2.72639 0.954486 0.000619
C  -0.980647 0.888153 0.000857
C  -3.789863 0.460162 0.000434
C  -1.881221 1.992489 -0.000219
C  -1.497229 -0.437352 0.00171
C  -3.26702 1.779879 -0.000439
C  -2.88995 -0.636404 0.001472
C  4.023832 0.369623 0.000021
C  1.487803 0.289259 0.001938
C  -5.266294 0.28922 0.000213
C  5.134213 1.257787 -0.00138
C  4.252306 -1.033027 0.000755
C  6.453641 0.763773 -0.00204
C  5.574261 -1.527029 0.00009
C  6.657769 -0.629418 -0.001295
C  -7.113565 -1.320048 -0.001855
C  -7.291305 -2.834841 -0.002008
H  -1.489879 3.0183 -0.000879
H  -0.806376 -1.281122 0.002545
H  -3.96708 2.621493 -0.001249
H  -3.293464 -1.652763 0.002134
H  0.61819 2.19169 0.000257
H  2.721886 1.976695 -0.000134
H  4.973736 2.343573 -0.001961
H  3.402599 -1.716876 0.001844
H  7.303778 1.451426 -0.003116
H  5.751375 -2.606438 0.000656
H  -7.553085 -0.840714 0.891781
H  -7.551096 -0.840772 -0.896497
H  -8.368057 -3.084777 -0.003199
H  -6.829345 -3.286294 -0.896643
H  -6.831338 -3.286239 0.893681
