program: Gaussian 09
title: 000295292
version: EM64L-G09RevD.01
frameworkgroup: C1[X(C15H15ClN2O2)]
method: RPBEPBE
basis: SDD
operation: Freq
keyword: #p
keyword: freq=noraman
keyword: PBEPBE/SDD
title: #p freq=noraman PBEPBE/SDD
converged: YES YES NO NO
title: Mulliken charges:
elementType: Cl O O N N C C C C C C C C C C C C C C C H H H H H H H H H H H H H H H
charge: -0.068610 -0.333995 -0.289400 -0.495697 -0.503097 0.281050 0.197592 -0.311873 -0.326952 0.493465 0.264276 -0.235227 -0.253516 -0.232015 -0.442605 -0.318280 -0.186828 -0.201262 -0.689869 -0.119515 0.330333 0.307197 0.243765 0.227266 0.225428 0.293280 0.214620 0.214626 0.220836 0.313084 0.253102 0.253193 0.228973 0.229169 0.217486
chargesum: 0.00000
title: Mulliken charges with hydrogens summed into heavy atoms:
elementType: Cl O O N N C C C C C C C C C C C C C C C
charge: -0.068610 -0.333995 -0.289400 -0.165363 -0.209817 0.281050 0.197592 -0.004676 -0.083187 0.493465 0.264276 -0.007961 -0.028088 0.197231 -0.221769 -0.005196 0.066274 0.051931 -0.014240 -0.119515
polarizability: 3.47826103e+02 1.50126698e+01 2.10910696e+02 1.19536046e-01 -6.62886860e-01 8.34220472e+01
1716.lowfreq: -9.2186 -1.6914 -0.0018 -0.0013 -0.0008 4.9274 14.8900 27.4057 48.2345
frequency: 13.7307 27.4031 48.2258 62.2717 70.0997 84.1058 103.5632 109.7942 138.9266 183.4959 192.6667 199.7339 247.0497 260.2090 296.7306 307.7521 316.5926 324.8776 365.9875 405.3504 410.1033 445.7176 478.6808 486.9313 527.2758 556.6434 561.4130 592.4415 623.4693 664.2222 683.0499 700.8426 702.7462 731.9717 749.5611 751.0189 777.7494 798.5402 807.6911 825.0381 842.7543 857.0059 879.8712 909.4707 930.8303 934.6796 977.3902 982.5761 991.3424 1000.5460 1040.6433 1042.6318 1073.9687 1106.4255 1114.5184 1117.4469 1140.0659 1173.7492 1182.8997 1186.4716 1191.1216 1254.2491 1263.3495 1268.9997 1293.8404 1307.9915 1361.8825 1368.5091 1394.3132 1401.1023 1402.9671 1440.6158 1464.4438 1473.3243 1479.6046 1482.2582 1495.0276 1506.1161 1524.7813 1594.1567 1606.3052 1608.5699 1611.8993 1648.4106 2964.8754 2996.4295 3023.7030 3094.3610 3103.7460 3115.8401 3136.9440 3155.5377 3165.1045 3172.0661 3173.1226 3197.2379 3197.9384 3485.0988 3528.3637
redmass: 4.0636 7.0562 5.5625 4.0916 5.5660 4.3832 5.2960 2.0418 5.4216 5.3928 7.5582 4.5902 1.1737 6.3181 4.0528 8.3054 4.6811 3.8528 5.1371 9.4714 3.0208 2.7320 5.0168 1.9801 1.9532 7.1445 3.3144 6.4567 7.1368 6.8746 1.4013 2.9739 5.4108 4.1993 5.3177 1.2552 5.7306 5.5779 1.4098 1.1070 1.4133 1.3405 5.6203 3.2353 1.3579 1.3479 1.3159 1.2954 4.5356 6.2999 2.9791 2.0553 2.5514 2.2162 1.3847 2.0229 1.4449 1.0668 1.1289 2.1265 2.9933 2.0318 1.1347 1.8348 1.3917 1.8779 3.8516 1.4689 2.3829 2.1956 3.0753 2.4800 1.0406 1.6837 2.3761 1.1919 1.2241 2.1804 2.5161 5.8605 5.8710 6.2448 6.4472 3.7540 1.0557 1.0361 1.1077 1.0988 1.1017 1.0902 1.0858 1.0918 1.0911 1.0971 1.0949 1.0950 1.0950 1.0762 1.0761
irintensity: 0.4675 0.3483 0.0317 0.0008 4.5477 4.0159 1.4025 5.6051 0.6364 4.5188 0.1294 1.0203 1.1853 3.7979 0.5251 5.1858 0.1117 7.5406 0.2889 28.7928 0.0124 0.7125 2.2033 51.0516 0.5041 1.8116 4.3580 4.6554 1.1989 22.2507 60.4326 18.7486 36.3668 8.8383 15.7104 136.0836 3.0073 2.9990 45.0413 1.1660 59.9655 4.2546 3.2601 38.7936 0.6572 7.7982 2.5129 4.0562 25.1413 13.1128 71.9730 34.7169 41.9798 38.4283 19.0663 50.7941 4.4506 8.9114 17.1622 214.5616 130.3038 153.5428 0.0039 105.5805 43.0474 43.5636 105.1634 115.6951 57.0352 6.3484 49.8033 227.3564 13.1026 84.8909 209.3014 10.0212 17.7605 1080.9045 318.8867 35.1917 15.3354 61.0861 70.3319 82.6763 46.1274 19.1157 29.2228 31.0224 37.0117 18.1162 1.0804 25.9141 2.8188 19.8751 3.1674 10.7542 7.3753 77.4456 14.9708
temp: 298.150 k
press: 1.00000 atm
elementType: 17 8 8 7 7 6 6 6 6 6 6 6 6 6 6 6 6 6 6 6 1 1 1 1 1 1 1 1 1 1 1 1 1 1 1
symmnumber: 1
zpe: 712215.7 jmol-1
zpe.correction: 0.271269 hartree
zpe.thermalcorrener: 0.290068 hartree
zpe.thermalcorrenthalpy: 0.291012 hartree
zpe.thermalcorrgfe: 0.221421 hartree
zpe.sumelectzpe: -1299.190295 hartree
zpe.sumelectthermal: -1299.171495 hartree
zpe.sumelectthermalent: -1299.170551 hartree
zpe.sumelectthermalfe: -1299.240142 hartree
dipole: -5.5203 5.1167 -0.0181
dipole: 7.5270
quadrupole: -122.5341 -109.8018 -130.7602
quadrupole: -7.5579 -0.1180 -0.1852
quadrupole: -1.5020 11.2302 -9.7281 -7.5579 -0.1180 -0.1852
hfenergy: -1299.4615634 hartree
pointgroup: C01[X(C15H15Cl1N2O2)]
dipole: 2.1010587 -2.0833106 -0.1221333 debye
polarizability: 348.3788806|10.5524929|209.9810253|-8.7833646|3.0068829|83.798941 unknown
InChI: InChI=1S/C15H15ClN2O2/c1-2-20-14-6-4-3-5-13(14)18-15(19)17-12-9-7-11(16)8-10-12/h3-10,17-18H,2H2,1H3
charge 0 multiplicity 1
35 atoms
Cl -7.340319 0.126436 0.209893
O  3.088882 -1.560818 -0.183912
O  -0.52766 1.785561 0.006015
N  0.979186 -0.024599 -0.092893
N  -1.308754 -0.443258 -0.03215
C  2.220564 0.658901 -0.117131
C  3.380596 -0.176789 -0.167567
C  2.384392 2.063478 -0.096005
C  4.673143 0.379226 -0.196521
C  -2.713527 -0.245336 0.025888
C  -0.298677 0.540729 -0.035446
C  3.685259 2.617971 -0.125182
C  4.823873 1.78739 -0.175092
C  4.219756 -2.507217 -0.233638
C  -3.535257 -1.40651 0.007924
C  -3.32353 1.037121 0.101181
C  -4.939175 -1.300317 0.063904
C  -4.729612 1.142819 0.157056
C  3.631841 -3.91555 -0.238877
C  -5.520687 -0.020451 0.138023
H  1.089857 -1.043645 -0.118002
H  1.495898 2.695747 -0.056675
H  5.558232 -0.262054 -0.235076
H  3.800916 3.706658 -0.108495
H  5.828275 2.222803 -0.197593
H  -1.01416 -1.421096 -0.076076
H  4.813361 -2.313582 -1.149854
H  4.867598 -2.343351 0.651116
H  -3.079225 -2.403139 -0.050501
H  -2.695083 1.928737 0.114777
H  -5.564924 -2.196912 0.049455
H  -5.199065 2.12915 0.214975
H  2.984939 -4.067949 -1.119825
H  3.036094 -4.095471 0.672442
H  4.445193 -4.662682 -0.273535
