program: Gaussian 09
title: 000294463
version: EM64L-G09RevD.01
frameworkgroup: C1[X(C14H22N6O4)]
method: RPBEPBE
basis: SDD
operation: Freq
keyword: #p
keyword: freq=noraman
keyword: PBEPBE/SDD
title: #p freq=noraman PBEPBE/SDD
converged: YES YES NO NO
title: Mulliken charges:
elementType: O O O O N N N N N N C C C C C C C C C C C C C C H H H H H H H H H H H H H H H H H H H H H H
charge: -0.282737 -0.443240 -0.461697 -0.447080 -0.186321 -0.085283 -0.185848 -0.345222 -0.071873 -0.546672 -0.162370 -0.084935 -0.161251 -0.080743 -0.330866 0.242348 -0.202034 -0.130249 0.193904 -0.396417 -0.347390 -0.345332 -0.349035 -0.412867 0.235530 0.263332 0.238863 0.250935 0.229257 0.188331 0.392756 0.372715 0.293580 0.371702 0.329499 0.218971 0.253882 0.188347 0.221769 0.250152 0.194719 0.183262 0.207233 0.211650 0.264147 0.262578
chargesum: 0.00000
title: Mulliken charges with hydrogens summed into heavy atoms:
elementType: O O O O N N N N N N C C C C C C C C C C C C C C
charge: -0.282737 -0.050483 -0.088982 -0.075378 -0.186321 -0.085283 -0.185848 -0.015723 -0.071873 -0.019946 0.073160 0.178396 0.077611 0.170192 0.086722 0.242348 0.091546 -0.130249 0.193904 0.076437 0.062726 -0.095180 0.028945 0.006016
polarizability: 3.17388013e+02 -6.90588367e-01 1.93011424e+02 9.03482246e+00 -1.31114280e+01 1.39089155e+02
1716.lowfreq: -8.0466 -4.2565 -0.0011 0.0006 0.0008 3.5691 13.0519 18.8124 37.7922
frequency: 12.1288 17.5740 37.7115 43.2670 46.9241 61.7739 83.1947 88.6371 106.3013 121.3651 134.1178 143.8545 148.1308 172.2577 188.3729 214.7706 237.0540 246.4287 257.3281 264.2089 266.4192 308.8367 317.2074 344.6712 369.8112 390.9450 403.7714 414.8070 472.1890 477.8767 490.5201 518.2862 527.3332 541.5344 554.7059 588.7136 604.7266 617.4031 624.2721 639.8944 649.8497 663.7898 715.1330 734.9665 779.5972 786.5138 791.2968 838.0985 863.6633 881.9876 889.4633 895.9603 910.9695 929.4608 949.0998 960.9089 983.5824 988.9247 1007.2897 1009.6430 1028.1119 1044.8622 1050.4822 1062.2346 1080.1286 1089.9654 1092.2816 1102.2647 1113.8519 1132.4579 1145.6420 1155.9390 1173.3839 1198.6774 1216.7037 1238.6403 1244.7242 1247.1695 1250.8819 1257.5387 1276.5422 1285.5697 1290.6056 1295.4896 1301.3514 1311.0645 1326.6108 1332.3862 1334.5058 1340.1442 1355.0986 1355.2342 1363.7411 1368.0015 1375.4989 1380.9378 1394.1663 1405.5071 1426.6338 1440.3415 1457.0216 1461.5773 1467.3685 1480.0268 1481.3177 1485.6587 1503.3923 1539.1986 1620.9406 1643.8190 2931.4027 2955.0302 2955.3091 2962.6471 2972.3931 2974.2616 2982.1557 2996.2029 2998.6460 3002.2443 3013.3098 3033.2521 3049.2061 3084.4247 3085.7357 3165.9045 3261.1565 3459.3791 3466.0308 3538.2446 3563.7584 3586.1041
redmass: 5.3551 5.9030 6.0910 3.7307 2.0991 6.5500 2.9926 6.4391 4.4786 3.8107 2.1781 3.8085 7.0105 3.5619 5.1241 4.2613 5.3017 4.8942 1.1046 5.7188 3.9135 4.4156 6.0859 3.0569 5.7258 1.1871 3.8391 3.5992 2.5615 1.4838 2.9104 3.8576 3.5663 4.0453 3.8032 1.7052 5.4956 2.0395 2.7446 5.2759 4.6432 6.2805 2.9814 1.1566 1.4930 7.7076 3.8270 1.4589 4.4467 1.7096 1.2605 1.3260 5.0198 1.4234 5.7467 5.7237 6.9686 5.1368 4.3161 1.1905 4.4223 4.2722 4.1995 3.1867 2.0828 2.7217 3.4014 4.0197 3.3400 2.2637 1.6923 2.1041 1.8741 1.9017 1.4062 1.2501 1.3453 1.3747 1.4357 1.1620 2.2999 1.0997 2.4206 1.5732 1.2971 1.3818 1.3286 2.1348 1.2111 1.6158 1.3716 1.3510 1.4839 1.3589 3.5100 1.7989 1.2672 1.5098 3.2363 1.6271 1.1018 1.1667 1.0983 1.3575 1.1142 1.0945 4.6470 6.0008 5.8868 1.0894 1.0716 1.0671 1.0709 1.0695 1.0611 1.0844 1.0609 1.0697 1.0855 1.0937 1.0846 1.1005 1.1043 1.0964 1.1004 1.0924 1.0990 1.0445 1.0671 1.0772 1.0661 1.0978
irintensity: 0.1011 0.2640 1.0320 1.0276 2.1022 1.8517 2.9415 1.3337 8.5375 1.7757 0.3506 0.5980 7.2757 2.6412 6.3389 2.6598 1.9040 7.9147 54.3978 4.9212 2.7890 5.4347 3.2151 10.0605 2.5128 48.8807 1.2035 10.2032 46.2976 231.0872 40.3331 15.0187 78.1374 12.4498 9.4108 293.3566 4.9535 64.7776 42.0707 20.7064 21.1671 17.0037 2.1622 12.8713 11.6381 6.9814 24.6021 15.5594 8.1494 16.8184 69.2905 58.3444 13.7700 3.8186 50.1697 93.5141 242.5003 16.2248 51.8279 2.6052 1.4468 12.4594 20.2193 16.0044 72.0858 1.7871 39.0626 21.0448 81.1352 9.8957 22.4812 9.4554 8.2540 68.4975 13.8205 19.6036 1.6745 22.5404 12.8404 5.0366 143.3343 2.8898 21.0608 23.3449 14.8307 62.1468 7.3778 6.6688 1.6296 126.0177 2.2807 2.2283 28.9804 37.6215 44.3350 55.1622 31.4887 34.7971 42.3963 30.9427 3.8602 3.9831 1.7122 180.5651 21.9015 5.3515 13.3932 41.6330 749.1115 33.0078 854.5274 147.7362 106.1601 41.1419 13.8947 41.8133 68.4543 45.4591 27.5313 16.0670 65.5262 3.2542 95.6677 28.7341 14.5207 12.5933 5.3251 1.2923 42.9353 65.2325 18.2729 0.3810
temp: 298.150 k
press: 1.00000 atm
elementType: 8 8 8 8 7 7 7 7 7 7 6 6 6 6 6 6 6 6 6 6 6 6 6 6 1 1 1 1 1 1 1 1 1 1 1 1 1 1 1 1 1 1 1 1 1 1
symmnumber: 1
zpe: 977301.3 jmol-1
zpe.correction: 0.372234 hartree
zpe.thermalcorrener: 0.396020 hartree
zpe.thermalcorrenthalpy: 0.396964 hartree
zpe.thermalcorrgfe: 0.315909 hartree
zpe.sumelectzpe: -1174.230448 hartree
zpe.sumelectthermal: -1174.206663 hartree
zpe.sumelectthermalent: -1174.205719 hartree
zpe.sumelectthermalfe: -1174.286774 hartree
dipole: -4.1216 -0.1311 -2.3694
dipole: 4.7560
quadrupole: -154.0807 -140.0747 -154.4555
quadrupole: 10.9130 0.7146 1.5449
quadrupole: -4.5437 9.4622 -4.9185 10.9130 0.7146 1.5449
hfenergy: -1174.6026829 hartree
pointgroup: C01 [X(C14H22N6O4)]
dipole: 1.6097275 0.5627489 0.7702223 debye
polarizability: 317.1257192|7.7529239|184.6267907|8.2159518|-23.5099929|147.7360819 unknown
InChI: InChI=1S/C14H22N6O4/c15-3-1-2-4-16-12-9-13(18-6-17-12)20(7-19-9)14-11(23)10(22)8(5-21)24-14/h6-8,10-11,14,16,21-23H,1-5,15H2
charge 0 multiplicity 1
46 atoms
O  -3.792224 -1.047312 0.821039
O  -2.8173 2.221434 -0.570883
O  -5.004038 0.612642 -2.222347
O  -6.895578 -1.473662 -1.282218
N  -1.477099 -0.389054 0.941932
N  0.318085 -1.668082 1.575449
N  -0.257344 1.636309 0.134771
N  3.182221 -0.567195 1.259854
N  2.172918 1.391414 0.35829
N  8.827343 -0.250127 -1.749943
C  -3.078375 0.806645 -0.590364
C  -2.865084 0.091878 0.779491
C  -4.560552 0.500871 -0.83545
C  -4.673342 -0.972334 -0.394773
C  -6.09993 -1.412772 -0.051714
C  -0.338422 0.374159 0.671079
C  -1.02583 -1.601844 1.490446
C  0.757057 -0.431461 1.068802
C  2.063398 0.124184 0.895859
C  4.558225 -0.071321 1.086689
C  5.257696 -0.640913 -0.170406
C  1.03847 2.062574 0.01793
C  6.709593 -0.129025 -0.304831
C  7.43874 -0.70436 -1.551824
H  -2.472002 0.27889 -1.360369
H  -3.104372 0.784415 1.610954
H  -5.170361 1.155817 -0.176428
H  -4.263635 -1.626166 -1.190071
H  -6.10831 -2.430793 0.370224
H  -6.5419 -0.714244 0.690375
H  -1.811441 2.305627 -0.383588
H  -4.840657 1.538984 -2.533918
H  -1.722457 -2.381798 1.783248
H  -6.656907 -0.696535 -1.858782
H  3.0292 -1.510928 1.624045
H  5.140744 -0.331626 1.991746
H  4.501708 1.027814 1.016026
H  5.256684 -1.749784 -0.12812
H  4.671254 -0.353139 -1.064587
H  1.180893 3.062174 -0.402592
H  6.710842 0.979165 -0.366974
H  7.289404 -0.395947 0.604214
H  7.444134 -1.810516 -1.491182
H  6.860248 -0.447502 -2.46061
H  8.920155 0.74838 -1.959435
H  9.479251 -0.54864 -1.018153
