program: Gaussian 09
title: 000295320
version: EM64L-G09RevD.01
frameworkgroup: C1[X(C24H24N2O2)]
method: RPBEPBE
basis: SDD
operation: Freq
keyword: #p
keyword: freq=noraman
keyword: PBEPBE/SDD
title: #p freq=noraman PBEPBE/SDD
converged: YES YES NO NO
title: Mulliken charges:
elementType: O O N N C C C C C C C C C C C C C C C C C C C C C C C C H H H H H H H H H H H H H H H H H H H H H H H H
charge: -0.252414 -0.254226 -0.481277 -0.477090 0.324713 0.324894 0.313284 0.309339 -0.567246 -0.567684 0.272763 0.275896 -0.393752 -0.394277 -0.506487 -0.353979 -0.353485 0.084489 0.086694 -0.668146 -0.667809 -0.360028 -0.359707 -0.253151 -0.252696 -0.236479 -0.236362 -0.217311 0.233240 0.191641 0.198620 0.237535 0.329480 0.324626 0.230832 0.230534 0.213062 0.308660 0.309009 0.216725 0.234308 0.224714 0.238237 0.227972 0.198320 0.279016 0.279849 0.228102 0.228105 0.229516 0.229550 0.239886
chargesum: 0.00000
title: Mulliken charges with hydrogens summed into heavy atoms:
elementType: O O N N C C C C C C C C C C C C C C C C C C C C C C C C
charge: -0.252414 -0.254226 -0.151797 -0.152464 0.324713 0.324894 0.313284 0.309339 -0.142366 -0.131530 0.272763 0.275896 -0.162920 -0.163743 -0.293425 -0.045319 -0.044476 0.084489 0.086694 0.007600 -0.003280 -0.081012 -0.079858 -0.025050 -0.024591 -0.006963 -0.006812 0.022575
polarizability: 3.83496032e+02 2.76006640e+00 3.42115407e+02 4.58616317e+01 4.42754721e+00 1.76608367e+02
1716.lowfreq: -5.1823 -0.0006 -0.0002 0.0006 0.4055 7.6202 18.0150 23.7836 26.1905
frequency: 17.3841 23.6788 26.1461 42.8876 48.9072 58.1779 68.0302 80.5168 97.0159 105.4137 118.2773 124.9953 151.9297 160.0843 182.4782 202.5009 206.1616 218.1942 246.3360 249.8135 254.0895 286.8875 313.8601 325.1627 341.0652 342.3031 375.6746 410.9287 423.8382 425.0979 466.7756 472.0302 490.4825 500.7780 529.6291 535.6432 567.9292 570.2588 587.3866 595.5189 629.8588 649.4573 659.9114 673.3967 705.0718 716.6102 734.7777 741.9263 749.8083 754.5001 768.1945 769.5899 773.6383 784.3203 790.5309 830.4233 831.0895 840.7169 861.7628 887.2760 888.2341 904.3096 915.0046 958.0364 958.7060 960.8359 964.8406 965.7379 988.1406 997.8016 998.9924 1010.8403 1026.8409 1028.0600 1051.5155 1051.7885 1060.3261 1062.5713 1070.8663 1086.9110 1106.5900 1124.6278 1132.8052 1174.4953 1174.7060 1179.8744 1193.4788 1195.8353 1218.2456 1234.4253 1236.4156 1263.1053 1265.4330 1268.8188 1295.9761 1301.0698 1311.3571 1313.9734 1317.6594 1379.0327 1381.3484 1386.8368 1391.5812 1395.1886 1412.2377 1436.3509 1440.9123 1451.1062 1457.3216 1469.8687 1472.0511 1476.3048 1486.4286 1486.9332 1496.9239 1498.4162 1515.1542 1520.3515 1579.6993 1586.1274 1595.0005 1597.7768 1610.9685 1613.1903 1616.1157 1616.9297 2948.3810 2956.3132 2976.9406 2983.4512 3033.1759 3036.3008 3070.5668 3078.1398 3086.2140 3088.2726 3105.0308 3118.8515 3119.3030 3137.8644 3137.9541 3144.5907 3160.7256 3160.9971 3162.4796 3173.8073 3193.4408 3194.1663 3544.1609 3544.4678
redmass: 4.0913 4.2671 5.3632 5.1882 4.5548 4.4324 4.1820 4.6456 3.8052 3.7923 3.4736 3.5039 3.6483 3.9591 4.1539 1.2994 1.4114 3.1338 3.2184 3.1824 4.0341 3.9987 5.4495 5.0984 3.6118 4.3839 6.4105 3.1923 2.9119 2.8346 3.9330 3.7517 4.4515 4.2790 3.9646 3.9181 3.6172 3.5857 5.8956 6.4608 1.2734 3.0447 1.6313 4.4620 4.2249 2.2123 5.1923 6.2248 3.4204 3.3934 1.8459 1.3115 2.1093 1.2793 1.2808 3.5010 3.5103 1.6871 6.7515 1.3594 1.3601 1.7712 5.1428 1.3688 1.3697 1.4005 2.4921 2.5115 6.2311 1.3106 1.3093 1.3720 1.8218 1.7938 2.0898 2.0831 1.8714 1.8634 2.8301 2.2647 1.8187 1.6566 1.8050 1.1051 1.0970 1.0918 1.7317 1.8002 2.4144 1.3501 1.3467 1.9796 2.6131 2.0074 1.6916 1.7968 1.3374 1.4901 1.4872 5.6504 5.7808 9.4201 1.2078 1.1963 3.1132 2.3819 2.5342 2.1249 2.0352 1.0480 1.0477 2.0259 1.1765 1.1292 1.3383 1.3497 1.8243 1.7256 6.3082 7.5051 5.5571 4.7982 5.8063 4.8117 6.5113 4.9489 1.0684 1.0686 1.0363 1.0358 1.0919 1.0922 1.0989 1.0997 1.1005 1.1005 1.0898 1.0878 1.0878 1.0897 1.0897 1.0873 1.0983 1.0983 1.0922 1.0992 1.0950 1.0950 1.0752 1.0751
irintensity: 0.5200 0.2707 0.1892 0.4418 1.3320 0.9270 6.2479 4.6683 0.6872 0.5628 0.6986 0.3983 3.0434 2.7672 0.5772 0.5728 0.7375 2.0704 2.5599 0.8415 0.6167 2.0937 4.7900 3.9020 3.1022 4.2303 1.0838 4.7037 0.0932 0.3273 1.7397 15.7301 3.0714 16.7506 4.6854 8.5793 2.3080 1.4299 11.6488 7.6788 65.2341 21.2284 9.4062 29.9289 10.5018 43.5866 2.0826 0.6133 1.6919 2.5592 21.4905 154.0364 19.4138 7.7618 1.8385 6.2332 4.4960 15.2061 9.8282 1.8517 1.8877 16.9042 5.3972 4.1700 5.3077 2.3964 3.3353 3.4984 1.6887 2.1497 2.6347 1.7796 2.7607 1.4188 1.0418 42.5161 3.3380 4.7556 34.2928 7.2291 8.2111 0.6550 3.2818 0.2369 0.2003 7.2460 6.9899 3.3905 147.4326 0.5740 3.7708 30.8675 22.9741 19.0896 44.7343 79.8148 13.8291 14.3007 9.1316 52.5327 67.3569 0.7725 8.3331 12.1757 0.4620 96.2652 200.7908 7.3952 34.2818 12.3846 8.0758 10.4151 26.8504 11.8704 67.9840 124.6119 267.4256 266.8393 67.7375 65.0477 71.4107 40.4968 89.9040 32.1113 3.0683 3.5397 58.1612 34.1493 37.3883 25.9589 11.0244 5.7742 58.3943 44.9827 34.3229 31.0542 11.4368 9.5367 9.7989 15.3004 15.5352 8.7668 36.0602 29.1708 0.0966 11.4416 10.3943 9.5098 16.4051 16.5972
temp: 298.150 k
press: 1.00000 atm
elementType: 8 8 7 7 6 6 6 6 6 6 6 6 6 6 6 6 6 6 6 6 6 6 6 6 6 6 6 6 1 1 1 1 1 1 1 1 1 1 1 1 1 1 1 1 1 1 1 1 1 1 1 1
symmnumber: 1
zpe: 1107635.1 jmol-1
zpe.correction: 0.421876 hartree
zpe.thermalcorrener: 0.447571 hartree
zpe.thermalcorrenthalpy: 0.448515 hartree
zpe.thermalcorrgfe: 0.363898 hartree
zpe.sumelectzpe: -1186.968643 hartree
zpe.sumelectthermal: -1186.942948 hartree
zpe.sumelectthermalent: -1186.942004 hartree
zpe.sumelectthermalfe: -1187.026622 hartree
dipole: -0.2029 -3.7235 0.2645
dipole: 3.7384
quadrupole: -176.6519 -152.3498 -169.2467
quadrupole: 0.1824 -8.3287 0.6675
quadrupole: -10.5691 13.7330 -3.1639 0.1824 -8.3287 0.6675
hfenergy: -1187.3905194 hartree
pointgroup: C01 [X(C24H24N2O2)]
dipole: 0.0683435 1.4676496 0.0674187 debye
polarizability: 382.4963043|1.8886565|341.828816|-47.968594|-8.8799474|177.8946862 unknown
InChI: InChI=1S/C24H24N2O2/c1-3-17-10-5-7-14-21(17)25-23(27)19-12-9-13-20(16-19)24(28)26-22-15-8-6-11-18(22)4-2/h5-16,25-26H,3-4H2,1-2H3
charge 0 multiplicity 1
52 atoms
O  3.362342 -2.212727 -1.173016
O  -3.520199 -2.126725 1.155432
N  2.595656 -0.339309 0.033283
N  -2.724093 -0.355801 -0.178944
C  3.556118 1.850941 0.551836
C  -3.649034 1.800859 -0.869956
C  3.656079 0.599901 -0.139813
C  -3.801862 0.578203 -0.13816
C  2.402474 2.166176 1.499656
C  -2.366548 2.138258 -1.624961
C  1.147897 -2.302107 -0.192286
C  -1.277181 -2.285322 0.248463
C  4.589196 2.798878 0.368308
C  -4.712688 2.731765 -0.843399
C  -0.066552 -1.593119 -0.010422
C  4.770533 0.327482 -0.977583
C  -4.991927 0.320841 0.593264
C  2.463694 -1.624102 -0.496124
C  -2.60402 -1.591588 0.457767
C  2.55368 1.493081 2.893222
C  -1.224501 2.629714 -0.69119
C  1.139246 -3.718738 -0.136523
C  -1.25777 -3.698905 0.353215
C  5.700197 2.537164 -0.464118
C  -5.898348 2.485914 -0.115259
C  5.783278 1.296341 -1.133392
C  -6.028627 1.276943 0.602909
C  -0.056543 -4.410037 0.149432
H  2.350762 3.260804 1.643401
H  1.422772 1.887242 1.054648
H  -2.01115 1.277769 -2.231389
H  -2.585069 2.93407 -2.359667
H  1.853797 -0.043276 0.669388
H  -1.961059 -0.107643 -0.810384
H  4.51636 3.760687 0.890838
H  -4.60476 3.667133 -1.406351
H  -0.066959 -0.49673 -0.074566
H  4.830068 -0.637034 -1.484217
H  -5.086273 -0.620866 1.136361
H  2.619503 0.391816 2.820149
H  3.477263 1.841743 3.387507
H  1.697413 1.741852 3.546178
H  -1.522695 3.561762 -0.179979
H  -0.30024 2.828904 -1.264016
H  -0.994318 1.889131 0.098367
H  2.078581 -4.250542 -0.318217
H  -2.19495 -4.212866 0.589217
H  6.4857 3.290238 -0.587646
H  -6.706843 3.224589 -0.113572
H  6.63894 1.074898 -1.780701
H  -6.94156 1.068726 1.17159
H  -0.052881 -5.503092 0.211615
