program: Gaussian 09
title: 000294790
version: EM64L-G09RevD.01
frameworkgroup: C1[X(C20H20BrNO4S)]
method: RPBEPBE
basis: SDD
operation: Freq
keyword: #p
keyword: freq=noraman
keyword: PBEPBE/SDD
title: #p freq=noraman PBEPBE/SDD
converged: YES YES NO NO
title: Mulliken charges:
elementType: Br S O O O O N C C C C C C C C C C C C C C C C C C C C H H H H H H H H H H H H H H H H H H H H
charge: 0.065207 0.826485 -0.287751 -0.619252 -0.674755 -0.236047 0.014284 -0.047514 0.281929 -0.212091 0.429818 -0.380583 -0.319093 -0.463786 0.326737 -0.347048 -0.088961 -0.223206 -0.196923 -0.232142 0.446756 -0.379208 -0.381686 -0.308144 -0.804928 -0.662462 -0.546610 0.235931 0.273193 0.285669 0.237792 0.286913 0.267358 0.264776 0.232905 0.234460 0.350173 0.229058 0.238436 0.225547 0.224323 0.217223 0.234483 0.224856 0.243107 0.298327 0.216444
chargesum: 0.00000
title: Mulliken charges with hydrogens summed into heavy atoms:
elementType: Br S O O O O N C C C C C C C C C C C C C C C C C C C C
charge: 0.065207 0.826485 -0.287751 -0.619252 -0.674755 -0.236047 0.014284 -0.047514 0.281929 -0.212091 0.429818 -0.144652 -0.045900 -0.178116 0.326737 -0.347048 0.148831 0.063707 0.070435 0.032634 0.446756 -0.146303 -0.147226 0.271087 -0.116621 0.014099 0.211268
polarizability: 6.41486538e+02 8.14358441e+00 3.21386677e+02 -1.21959976e+01 -6.59505749e+00 1.84760963e+02
1716.lowfreq: -35.5656 -8.7978 -2.1386 -0.0014 -0.0011 -0.0011 3.4313 5.0973 13.1221
frequency: -35.5331 -1.8000 12.9013 16.8860 33.3578 35.1477 36.7942 59.3159 79.1518 85.8009 92.1966 100.0778 121.0247 131.6851 142.6936 154.3690 167.0846 173.5074 196.3252 203.6871 225.7660 227.7191 250.9750 264.5892 269.5856 276.2648 293.7439 310.9936 330.3072 349.2745 365.3263 366.2437 397.1713 403.3373 407.2305 429.2085 446.9838 484.2009 502.9548 511.1867 524.4170 556.3730 572.5204 602.3878 616.2616 624.2143 637.5356 680.7854 695.9601 716.6929 739.6295 747.4375 755.0395 773.2947 777.0979 800.5934 815.3364 818.2080 827.6920 849.6962 850.8972 891.6440 905.8436 950.4436 953.1373 954.9307 976.5622 982.1181 984.8442 991.7216 998.3001 1032.0698 1046.3390 1046.9386 1048.3562 1101.3591 1107.2542 1119.6348 1123.2035 1134.9743 1166.0424 1175.2508 1189.9242 1212.1121 1216.1606 1247.8146 1264.1236 1275.6899 1286.6658 1295.2297 1357.6697 1366.9224 1375.3881 1387.7663 1389.6451 1397.0219 1402.9547 1414.6878 1426.2252 1430.1763 1458.1238 1460.1651 1470.1875 1472.0313 1472.3709 1475.9265 1477.0609 1487.7460 1494.8220 1498.1503 1504.9785 1527.9897 1587.9594 1598.3240 1602.1685 2945.8321 2949.1898 2975.4810 2991.2799 3047.6550 3056.6840 3058.4580 3085.6292 3087.1611 3098.6947 3100.4580 3117.9006 3119.8243 3139.9865 3142.1364 3145.5578 3152.1061 3179.5267 3191.5597 3213.8798
redmass: 1.0117 4.6441 6.9984 7.6860 4.6556 6.3665 4.3181 6.5286 5.4502 4.6001 3.6734 6.0383 3.2516 6.3297 5.4818 7.6057 2.5936 5.7935 5.0606 5.6148 7.9208 1.4210 1.2531 4.8151 4.1495 3.1825 4.4202 4.7234 4.2114 12.2113 4.5344 4.1828 4.4894 3.9559 3.9809 5.7947 6.1942 5.4095 3.7703 3.0278 5.0580 6.6964 5.7322 4.6650 4.1416 7.3542 12.5798 6.0670 6.7316 3.3451 4.9544 5.5630 14.1757 5.1444 4.6870 1.2781 1.1848 1.3141 1.5170 1.4221 3.4897 6.2363 1.4737 1.3172 1.4030 1.3144 1.3891 5.0520 1.4105 2.1269 4.8499 3.4929 3.7256 1.6846 2.2705 2.2180 1.2830 1.4989 1.2567 1.4587 1.3298 1.1654 2.9740 1.9685 2.8444 1.9644 1.8321 1.3291 1.2835 2.3544 3.3578 2.5664 5.2109 3.2956 1.3264 1.2245 1.6281 1.6111 2.2411 1.3769 1.0780 1.0439 2.0789 1.1678 1.0699 1.0712 3.7598 1.7725 1.4689 1.1474 6.6235 7.0662 6.8109 6.1465 6.3567 1.0660 1.0359 1.0387 1.0357 1.1043 1.0948 1.1032 1.0998 1.0982 1.1020 1.0873 1.0878 1.0882 1.1004 1.0949 1.0957 1.0915 1.0902 1.0908 1.0958
irintensity: 0.3949 1.1425 0.2866 2.0804 2.4353 0.9651 1.1386 4.6626 2.1068 1.5436 2.2506 3.3619 1.2321 0.3559 3.5936 1.3929 4.5978 6.9173 1.0414 17.5503 2.8326 0.5692 2.2952 0.7313 4.7999 2.1151 1.6132 11.8780 4.4225 30.0932 3.2493 12.3986 8.5895 26.8482 32.1218 5.5495 1.7909 0.0790 1.2415 27.9108 11.1699 7.4663 18.9273 30.3924 6.5025 3.0691 12.5033 20.3398 19.3510 1.2505 1.6172 41.3948 24.6998 13.0078 0.8353 7.7296 14.0001 60.2314 70.7787 10.1143 23.7018 71.4580 15.9459 3.9094 5.6109 9.8067 5.6847 12.9439 0.2352 22.1479 17.4871 21.3103 52.8693 12.7830 35.6789 9.8144 9.6177 13.0823 2.8623 12.9241 11.1260 32.2605 104.2834 110.1267 13.1529 68.9607 57.2785 9.7105 2.1219 97.8294 97.3573 46.7459 0.2621 6.6116 24.8729 11.3373 12.2322 6.3115 83.3842 2.7263 17.5428 10.0426 35.0033 21.0411 10.8148 9.3315 148.3584 135.2594 31.7839 20.8595 240.5463 31.8045 0.3113 8.1188 73.4340 35.0921 53.3562 49.4163 13.0216 8.3249 20.7369 16.2070 16.2980 21.2534 25.5716 42.1996 17.5070 13.8894 13.4510 12.4403 37.2175 2.8837 0.5750 1.2509 2.0238
temp: 298.150 k
press: 1.00000 atm
elementType: 35 16 8 8 8 8 7 6 6 6 6 6 6 6 6 6 6 6 6 6 6 6 6 6 6 6 6 1 1 1 1 1 1 1 1 1 1 1 1 1 1 1 1 1 1 1 1
symmnumber: 1
zpe: 920833.2 jmol-1
zpe.correction: 0.350727 hartree
zpe.thermalcorrener: 0.377497 hartree
zpe.thermalcorrenthalpy: 0.378442 hartree
zpe.thermalcorrgfe: 0.290582 hartree
zpe.sumelectzpe: -1539.141229 hartree
zpe.sumelectthermal: -1539.114458 hartree
zpe.sumelectthermalent: -1539.113514 hartree
zpe.sumelectthermalfe: -1539.201374 hartree
dipole: -0.9037 -0.3637 2.9896
dipole: 3.1443
quadrupole: -142.7385 -164.3392 -180.0294
quadrupole: 5.5946 -12.8549 5.6902
quadrupole: 19.6306 -1.9702 -17.6604 5.5946 -12.8549 5.6902
hfenergy: -1539.4919557 hartree
pointgroup: C01 [X(C20H20Br1N1O4S1)]
dipole: 0.014994 -0.9945858 -0.7354736 debye
polarizability: 591.5975625|127.412446|254.0034307|65.6756412|-36.2228688|302.033186 unknown
InChI: InChI=1S/C13H13BrNO2.C7H7O2S/c1-3-17-13-10-8-9(16-2)4-5-12(10)15-7-6-11(13)14;1-6-2-4-7(5-3-6)10(8)9/h4-8H,3H2,1-2H3;2-5H,1H3
charge 0 multiplicity 1
47 atoms
Br 5.433556 2.637021 -1.183073
S  -1.861154 0.758564 1.089241
O  2.997274 1.036421 -1.574601
O  -1.490573 -0.70781 1.911497
O  -0.589204 1.353634 0.160496
O  -0.060732 -2.518152 -0.409982
N  3.683375 0.0450 2.839332
C  2.726996 -0.388256 1.95366
C  2.652327 -0.207248 0.485787
C  -3.039608 0.112037 -0.27494
C  3.405803 0.781085 -0.285418
C  4.798312 0.751628 2.569515
C  1.707553 -1.183867 2.571395
C  1.716201 -0.98199 -0.22958
C  0.760209 -1.794516 0.418275
C  4.586659 1.450564 0.133645
C  5.238528 1.393932 1.385259
C  0.717221 -1.850873 1.852916
C  -2.845741 0.536679 -1.599469
C  -4.085426 -0.762239 0.076187
C  -4.793237 -0.812328 -2.287334
C  -3.722118 0.064151 -2.602718
C  -4.956958 -1.222726 -0.937096
C  1.63018 1.670267 -1.834066
C  -5.756302 -1.283497 -3.363585
C  1.194672 1.240966 -3.228163
C  -1.189032 -3.266134 0.188169
H  5.459877 0.87297 3.438421
H  1.761351 -1.265809 3.659512
H  1.684384 -0.929678 -1.319199
H  6.172396 1.958634 1.478682
H  -0.008686 -2.476556 2.371758
H  -2.003777 1.20146 -1.824778
H  -4.2040 -1.094352 1.113954
H  -3.575058 0.381036 -3.642728
H  -5.774027 -1.907084 -0.676848
H  0.914967 1.371069 -1.041825
H  1.815369 2.759137 -1.78113
H  -6.622196 -0.5980 -3.447396
H  -5.271206 -1.320002 -4.354806
H  -6.156212 -2.288312 -3.140048
H  0.268333 1.782321 -3.494852
H  1.965817 1.482839 -3.979855
H  0.981758 0.158757 -3.273521
H  -1.786133 -3.600837 -0.671249
H  -1.761368 -2.576599 0.838799
H  -0.811569 -4.137507 0.755162
