program: Gaussian 09
title: 000295315
version: EM64L-G09RevD.01
frameworkgroup: C1[X(C22H18Cl2N2O2)]
method: RPBEPBE
basis: SDD
operation: Freq
keyword: #p
keyword: freq=noraman
keyword: PBEPBE/SDD
title: #p freq=noraman PBEPBE/SDD
converged: YES YES NO NO
title: Mulliken charges:
elementType: Cl Cl O O N N C C C C C C C C C C C C C C C C C C C C C C H H H H H H H H H H H H H H H H H H
charge: -0.060765 -0.064815 -0.272439 -0.265963 -0.483687 -0.486684 0.237608 0.258193 0.334155 0.338118 0.289508 0.284378 -0.442494 0.126651 0.123495 -0.342838 -0.344601 -0.325688 -0.325034 -0.240104 -0.361890 -0.363336 -0.845881 -0.842002 -0.230210 -0.231473 -0.114220 -0.112600 0.246814 0.338288 0.344962 0.210312 0.286055 0.315040 0.314943 0.238078 0.258303 0.257950 0.234045 0.230110 0.253581 0.250368 0.233106 0.239364 0.257210 0.256089
chargesum: 0.00000
title: Mulliken charges with hydrogens summed into heavy atoms:
elementType: Cl Cl O O N N C C C C C C C C C C C C C C C C C C C C C C
charge: -0.060765 -0.064815 -0.272439 -0.265963 -0.145399 -0.141722 0.237608 0.258193 0.334155 0.338118 0.289508 0.284378 -0.195680 0.126651 0.123495 -0.132527 -0.058546 -0.010648 -0.010091 -0.002026 -0.103587 -0.105386 -0.128145 -0.119165 0.027000 0.024616 -0.114220 -0.112600
polarizability: 5.16803976e+02 5.79342922e-01 3.24961547e+02 -1.10854472e+01 8.28696489e+00 1.20369745e+02
1716.lowfreq: -12.2880 -3.1937 -0.0017 -0.0014 -0.0012 2.4674 6.0774 11.7807 20.2995
frequency: -10.5414 11.4940 20.2563 33.0330 36.1826 61.2442 66.5852 76.0582 115.1013 116.8188 132.7035 161.1859 171.8445 175.5347 185.3347 200.4993 204.1896 205.7219 212.4412 232.7208 238.8683 259.0707 305.0533 333.7053 349.4644 353.2146 379.8319 386.9548 418.4406 434.5810 445.7471 447.3597 451.6551 456.3320 487.8714 498.6086 531.8869 539.9143 546.8745 548.6850 627.0803 630.0000 636.0334 638.7519 660.9534 669.0527 701.6459 711.2564 721.7833 724.1155 748.7336 769.3439 811.0686 821.4336 841.4938 843.1088 857.8034 858.2877 865.6937 870.6657 871.6823 916.5716 932.9796 937.6866 979.4887 979.9551 987.1358 988.1401 988.8557 1007.9184 1039.9397 1042.1318 1075.2606 1088.1442 1090.3450 1095.8727 1103.3473 1120.5522 1129.3651 1188.7675 1192.6500 1193.7890 1216.8319 1261.4509 1263.8369 1265.0057 1284.5502 1289.2320 1313.1745 1370.2095 1372.3340 1390.3947 1396.2851 1397.5006 1400.7561 1401.1987 1415.8809 1448.4483 1455.7297 1474.5869 1481.1074 1482.2135 1483.4541 1485.2230 1512.9130 1517.6242 1572.6793 1582.5238 1588.1179 1592.5928 1609.5664 1610.7074 1615.4399 1619.3349 2955.7680 2959.2914 3025.3241 3029.3665 3093.1150 3093.6050 3117.0208 3124.8927 3151.0699 3156.1555 3157.3590 3168.0305 3169.6859 3171.0964 3196.2149 3197.1989 3549.5605 3549.8848
redmass: 4.1613 4.5462 10.7770 9.7620 6.4693 6.5785 6.9968 7.5860 6.1496 5.3789 4.9967 7.3840 2.1231 1.9518 3.4394 3.1371 1.6320 1.5915 5.3149 6.9022 6.1014 3.9107 6.4205 8.0589 4.9237 5.1704 8.6256 8.2145 3.2930 5.6472 3.2254 3.0850 3.9599 4.2144 5.5152 5.7245 5.4147 5.2558 3.1286 3.0752 2.3892 1.9681 2.2235 2.1910 6.9014 5.2561 6.4268 2.0950 3.8950 3.3388 7.5698 5.4086 4.3502 1.8182 1.3699 1.3676 6.1726 5.9904 6.7419 1.3407 1.3404 5.6217 1.6063 1.4258 1.3172 1.3180 1.5299 1.7191 4.1608 1.3673 1.5256 1.5160 3.4340 2.0800 1.9964 2.2357 1.7589 1.7555 1.9299 1.1536 1.7784 1.7828 2.6082 1.6874 1.7682 2.5127 1.7100 2.1493 1.5049 6.5103 6.4319 9.2212 1.2680 1.2831 3.7448 3.7977 2.9539 1.9333 1.9063 2.0744 1.0768 1.1344 1.4338 1.4998 1.9626 2.0364 6.2214 7.9929 5.6035 4.5427 7.0378 5.8050 4.6846 5.1337 1.0404 1.0401 1.0980 1.0979 1.0949 1.0945 1.0887 1.0905 1.0909 1.0927 1.0927 1.0913 1.0912 1.0976 1.0953 1.0953 1.0752 1.0751
irintensity: 2.9612 1.0462 0.3319 0.2605 1.0746 5.4887 1.7218 2.6807 2.6250 1.6232 0.5909 3.7358 1.6768 0.2846 2.9774 0.2380 0.4394 0.0259 0.2802 1.2374 0.5420 0.3671 13.6079 7.9380 0.2012 1.9166 14.3080 22.7368 1.1849 17.9541 2.3306 17.2507 4.5060 7.8902 1.1890 0.6380 1.4828 2.8989 32.0641 1.9227 16.8958 11.1118 29.4283 1.9897 7.4145 1.2573 54.0242 68.6341 1.2681 39.6387 1.4449 0.6725 19.9541 26.5894 46.7608 53.0277 28.3620 44.2759 26.1651 16.8345 16.8391 31.8031 14.1422 1.6404 3.3587 3.7723 7.6635 6.0929 2.6702 2.0188 6.8495 6.9547 17.4277 17.8946 3.3474 19.4797 32.3851 3.2373 5.7098 9.1103 22.6411 21.6738 226.2778 3.4894 0.3116 17.9216 16.6725 94.7952 14.1261 203.4925 42.7927 2.2985 16.7711 21.1866 63.7819 40.9285 7.9546 111.3867 75.8567 26.6703 34.4957 85.8863 281.3939 97.7557 544.5232 270.1179 105.7894 44.9946 26.5296 10.0503 20.7819 2.7819 77.9326 29.0074 25.9678 23.9798 19.3761 17.0568 18.2489 18.6789 22.5446 10.6913 10.2100 3.4348 3.9002 1.9416 1.3463 10.9601 10.5427 11.2908 17.7588 20.9458
temp: 298.150 k
press: 1.00000 atm
elementType: 17 17 8 8 7 7 6 6 6 6 6 6 6 6 6 6 6 6 6 6 6 6 6 6 6 6 6 6 1 1 1 1 1 1 1 1 1 1 1 1 1 1 1 1 1 1
symmnumber: 1
zpe: 908130.1 jmol-1
zpe.correction: 0.345888 hartree
zpe.thermalcorrener: 0.370802 hartree
zpe.thermalcorrenthalpy: 0.371746 hartree
zpe.thermalcorrgfe: 0.288389 hartree
zpe.sumelectzpe: -2027.306866 hartree
zpe.sumelectthermal: -2027.281953 hartree
zpe.sumelectthermalent: -2027.281008 hartree
zpe.sumelectthermalfe: -2027.364366 hartree
dipole: -4.3067 3.0505 1.7990
dipole: 5.5758
quadrupole: -214.8197 -165.6497 -182.9442
quadrupole: -25.2272 -4.2193 2.3666
quadrupole: -27.0151 22.1548 4.8603 -25.2272 -4.2193 2.3666
hfenergy: -2027.6527542 hartree
pointgroup: C01 [X(C22H18Cl2N2O2)]
dipole: -1.6436578 0.6350866 1.3066374 debye
polarizability: 511.6665267|25.3173346|274.7334183|-38.5738987|86.9977276|175.7353226 unknown
InChI: InChI=1S/C22H18Cl2N2O2/c1-13-10-17(23)6-8-19(13)25-21(27)15-4-3-5-16(12-15)22(28)26-20-9-7-18(24)11-14(20)2/h3-12,25-26H,1-2H3
charge 0 multiplicity 1
46 atoms
Cl -8.134366 -3.099006 -0.776514
Cl 8.734582 -1.929679 -1.682822
O  -1.533483 -0.780875 -0.916283
O  3.793911 2.39857 0.730655
N  -3.165619 0.110336 0.520378
N  3.320969 0.231069 -0.04212
C  -0.898144 1.058652 0.527038
C  1.48139 1.674132 0.719267
C  -4.310309 -0.668278 0.185646
C  4.61268 -0.238644 -0.412332
C  -5.512606 -0.418525 0.923253
C  4.70185 -1.572459 -0.92805
C  0.467959 0.804424 0.254623
C  -1.885281 0.056976 -0.026474
C  2.960727 1.475178 0.469936
C  -1.252534 2.226166 1.252513
C  1.110172 2.832524 1.450546
C  -4.286719 -1.65484 -0.835599
C  5.778675 0.562675 -0.288361
C  -0.247031 3.10671 1.709457
C  -6.666417 -1.172451 0.61271
C  5.969374 -2.067281 -1.308619
C  -5.566979 0.634285 2.018346
C  3.469585 -2.450275 -1.073986
C  -5.44911 -2.395908 -1.133225
C  7.035049 0.051712 -0.67485
C  -6.623845 -2.145245 -0.403915
C  7.113392 -1.257122 -1.179924
H  0.667228 -0.080436 -0.362427
H  -3.299533 0.770301 1.287559
H  2.565066 -0.444107 -0.163331
H  -2.301517 2.491618 1.4341
H  1.906504 3.50423 1.786216
H  -3.359355 -1.832823 -1.381693
H  5.688875 1.574863 0.10856
H  -0.524996 4.012531 2.257962
H  -7.594923 -0.997197 1.164533
H  6.058779 -3.083349 -1.704888
H  -4.858465 0.417463 2.843208
H  -5.342071 1.649085 1.631685
H  -6.57271 0.679332 2.465921
H  3.739968 -3.436609 -1.48373
H  2.968494 -2.63361 -0.10216
H  2.721777 -2.010429 -1.76413
H  -5.431662 -3.154536 -1.920585
H  7.93277 0.668854 -0.5807
