program: Gaussian 09
title: 000294446
version: EM64L-G09RevD.01
frameworkgroup: C1[X(C30H22O4)]
method: RPBEPBE
basis: SDD
operation: Freq
keyword: #pfreq=noraman
keyword: PBEPBE/SDD
title: #p freq=noraman PBEPBE/SDD
converged: YES YES NO NO
title: Mulliken charges:
elementType: O O O O C C C C C C C C C C C C C C C C C C C C C C C C C C C C C C H H H H H H H H H H H H H H H H H H H H H H
charge: -0.222169 -0.222192 -0.226669 -0.226669 0.357398 0.357396 0.310833 0.310839 -0.393828 -0.393865 -0.415942 -0.415911 -0.378907 -0.378899 -0.363462 -0.363458 0.134350 0.134392 -0.689290 -0.689263 0.153755 0.153783 0.296441 0.296423 -0.351524 -0.351564 -0.353461 -0.353452 -0.252933 -0.252929 -0.230203 -0.230209 -0.219781 -0.219779 0.242918 0.242916 0.245100 0.245106 0.276358 0.276360 0.288179 0.288137 0.263557 0.264650 0.263554 0.264616 0.283944 0.283963 0.276298 0.276301 0.235158 0.235159 0.234638 0.234637 0.234601 0.234599
chargesum: 0.00000
title: Mulliken charges with hydrogens summed into heavy atoms:
elementType: O O O O C C C C C C C C C C C C C C C C C C C C C C C C C C C C C C
charge: -0.222169 -0.222192 -0.226669 -0.226669 0.357398 0.357396 0.310833 0.310839 -0.150910 -0.150949 -0.170843 -0.170806 -0.102549 -0.102539 -0.075283 -0.075321 0.134350 0.134392 -0.161083 -0.161093 0.153755 0.153783 0.296441 0.296423 -0.067581 -0.067601 -0.077163 -0.077151 -0.017776 -0.017770 0.004435 0.004429 0.014820 0.014820
polarizability: 6.40942216e+02 -2.64003203e-02 2.87352271e+02 -2.70031216e+00 -3.70410842e-02 2.42400947e+02
1716.lowfreq: -0.0006 0.0011 0.0011 1.9595 2.7463 10.0031 12.9622 19.9581 22.6397
frequency: 12.9621 14.5559 22.4677 30.6365 40.9652 49.5420 56.7377 62.6767 64.7873 68.4965 88.3161 103.3457 121.7621 123.2637 140.4525 144.9503 159.4013 191.7056 208.8779 222.7980 228.3345 249.0931 315.9556 316.2009 350.7660 385.9082 394.9818 401.7224 401.8314 405.9010 409.0667 416.1343 424.7089 443.4248 457.1068 467.8557 482.7394 488.5039 492.3607 517.1300 546.5650 554.9421 592.5206 610.1063 614.2903 614.5151 623.4018 631.9323 637.0801 640.7821 692.2963 695.7220 697.9307 714.3206 730.0561 740.1419 741.2434 767.3336 775.6835 778.6569 818.2103 829.2961 854.4283 856.2537 862.1361 864.1679 864.1919 881.5308 937.4119 938.8790 953.7233 954.2229 977.8740 979.7646 985.9589 987.6242 988.8434 991.2781 996.1582 996.9004 997.8132 997.8519 999.3706 1009.8981 1012.0180 1012.1584 1014.7307 1024.1762 1028.7206 1050.4078 1052.3730 1090.4891 1090.5151 1127.8544 1128.3527 1144.5930 1145.2766 1174.9044 1174.9803 1194.3617 1195.2044 1203.3575 1210.7534 1231.6092 1240.1246 1262.9866 1265.7379 1293.9079 1296.4677 1299.6403 1312.1378 1319.7652 1325.8634 1326.0365 1350.1418 1377.7003 1389.7110 1389.7172 1418.3534 1423.1352 1438.1535 1438.1878 1463.7861 1464.7766 1483.9344 1484.5914 1489.9883 1520.0766 1536.7799 1546.2663 1560.3856 1566.0203 1580.5986 1585.3428 1594.2555 1594.3394 1610.9891 1611.1807 1616.2487 1620.6136 3039.9351 3039.9843 3109.7471 3109.7898 3130.2769 3130.2812 3135.3235 3138.2981 3138.6482 3140.0920 3140.0964 3142.8749 3149.3916 3149.3941 3153.7647 3157.0365 3159.5799 3159.5844 3163.2187 3165.2312 3169.8941 3169.9289
redmass: 6.7123 6.2261 6.7420 7.4110 5.6102 3.9309 5.8070 4.1712 5.6024 9.8236 4.0165 8.7540 8.1545 7.5814 6.7350 5.6550 5.6548 5.5477 6.1990 8.4096 5.1044 4.4963 7.5697 5.8373 6.5130 6.0942 4.0900 2.8792 2.8577 2.9283 2.8705 4.2972 3.6019 3.0831 4.4670 4.6465 4.9884 5.5930 3.5352 5.1195 5.4943 3.3208 3.8674 3.8186 6.4179 6.1125 6.9732 4.1472 6.1024 3.9832 4.6652 2.0805 2.1485 3.6504 3.9140 3.5497 2.8584 2.1326 2.5911 4.2636 2.4104 3.7379 1.4139 1.2588 1.6616 1.2473 1.2456 1.8930 2.5788 2.5179 1.4894 1.4865 2.5633 2.7137 2.4801 3.3485 3.4977 1.9134 2.1974 1.4474 1.5253 1.5202 1.7612 2.7324 1.3686 1.3730 3.2333 2.4231 2.1247 2.5046 2.2727 1.5833 1.5827 1.3538 1.5075 1.3528 1.4012 1.0666 1.0651 1.1692 1.1541 1.1635 1.2653 2.5659 1.9840 1.5251 1.7003 2.6275 2.9123 3.4888 1.5266 1.2984 1.3217 1.3179 2.5976 9.1401 8.7285 8.7326 3.1335 4.2155 2.2899 2.2911 1.1843 1.1693 2.0668 1.9632 2.0280 2.7416 7.2603 9.8687 7.2864 7.0159 7.5233 7.5604 6.5096 6.4867 5.9527 6.0009 6.1613 6.2848 1.0577 1.0577 1.1046 1.1046 1.0854 1.0854 1.0886 1.0884 1.0887 1.0887 1.0887 1.0875 1.0930 1.0930 1.0969 1.0958 1.0963 1.0963 1.0965 1.0967 1.1014 1.1014
irintensity: 0.2945 0.6573 0.0529 1.7444 0.2269 0.3823 1.4598 1.0965 1.7999 6.3018 0.1783 0.0505 2.9226 1.8657 6.0417 0.9973 2.7204 0.5857 1.3602 0.0752 33.5845 0.6350 1.1642 0.0045 0.0985 13.5848 0.8094 0.1544 1.3881 3.5768 0.0040 0.2460 7.7876 3.0144 3.6934 5.0676 5.5379 2.2615 5.3179 34.4058 0.0419 7.2967 95.1389 0.3117 0.5678 0.0112 1.7541 18.6377 0.6651 0.6685 4.4004 22.3137 83.1326 6.3165 7.7419 3.1199 9.0341 74.2445 31.9903 2.3249 66.0908 2.8333 33.8487 0.5304 72.1721 1.1214 1.0105 12.3356 238.3009 5.6946 49.6376 5.0100 13.1523 3.3294 0.3775 0.0252 5.1050 0.5673 37.5273 0.8771 0.8236 1.4117 0.6250 3.0139 0.2056 0.3801 121.6097 3.1180 10.4563 39.7937 147.0651 9.7118 12.0252 8.2760 26.9085 13.8866 0.1825 25.3389 0.0249 321.5918 1.0658 110.8317 10.4027 1175.1044 48.0683 217.4810 4.6196 1.2851 105.5429 22.3376 0.9850 2.9881 1.5335 3.4167 4.6179 15.4028 3.5340 4.2567 30.4026 26.3356 41.8185 6.8260 32.8330 14.4046 13.6733 1.6907 3.9220 11.0774 83.0512 508.2913 175.2073 1.7231 40.6956 99.9044 0.8999 23.9322 0.0232 90.6127 2.7157 125.4056 3.8027 3.4723 18.1369 2.4980 0.8337 0.7635 3.9852 5.3205 3.7547 8.0670 9.5322 3.0686 4.4277 2.7110 18.1080 5.4404 13.5535 13.4550 12.9352 4.9227 76.8614 2.0444
temp: 298.150 k
press: 1.00000 atm
elementType: 8 8 8 8 6 6 6 6 6 6 6 6 6 6 6 6 6 6 6 6 6 6 6 6 6 6 6 6 6 6 6 6 6 6 1 1 1 1 1 1 1 1 1 1 1 1 1 1 1 1 1 1 1 1 1 1
symmnumber: 1
zpe: 1132258.8 jmol-1
zpe.correction: 0.431255 hartree
zpe.thermalcorrener: 0.459817 hartree
zpe.thermalcorrenthalpy: 0.460761 hartree
zpe.thermalcorrgfe: 0.367576 hartree
zpe.sumelectzpe: -1454.976829 hartree
zpe.sumelectthermal: -1454.948267 hartree
zpe.sumelectthermalent: -1454.947323 hartree
zpe.sumelectthermalfe: -1455.040508 hartree
dipole: -0.0013 -0.4482 0.0034
dipole: 0.4482
quadrupole: -145.7691 -200.6517 -193.1255
quadrupole: -0.0095 12.9900 -0.0092
quadrupole: 34.0797 -20.8029 -13.2768 -0.0095 12.9900 -0.0092
hfenergy: -1455.408084 hartree
pointgroup: C01 [X(C30H22O4)]
dipole: 0.0003758 0.1763478 0.00096 debye
polarizability: 640.1480393|0.2042405|287.3523137|17.9757695|-0.0581654|243.1950815 unknown
InChI: InChI=1S/C30H22O4/c31-27(23-7-3-1-4-8-23)19-29(33)25-15-11-21(12-16-25)22-13-17-26(18-14-22)30(34)20-28(32)24-9-5-2-6-10-24/h1-18H,19-20H2
charge 0 multiplicity 1
56 atoms
O  5.273132 1.293999 2.2099
O  -5.276923 1.276349 -2.219768
O  5.613703 -2.545693 -0.001785
O  -5.611122 -2.552511 0.012379
C  0.694598 0.141722 0.261523
C  -0.695773 0.139453 -0.268604
C  3.367627 0.140154 1.2876
C  -3.369419 0.129372 -1.293073
C  1.268886 1.324655 0.813966
C  -1.271894 1.318889 -0.826593
C  1.493246 -1.03622 0.229934
C  -1.492789 -1.039414 -0.230997
C  2.580219 1.325445 1.312513
C  -2.583522 1.315513 -1.324359
C  2.805225 -1.04487 0.737844
C  -2.80506 -1.052272 -0.738071
C  4.757425 0.198409 1.83396
C  -4.759768 0.18329 -1.838479
C  5.573149 -1.107626 1.958182
C  -5.574401 -1.124163 -1.954765
C  6.180517 -1.60107 0.625776
C  -6.179484 -1.611381 -0.619017
C  7.431104 -0.963098 0.110827
C  -7.429673 -0.971636 -0.105295
C  8.022237 0.173555 0.729352
C  -8.022539 0.161525 -0.728554
C  8.035389 -1.520762 -1.051529
C  -8.031787 -1.523958 1.060731
C  9.199041 0.736255 0.190112
C  -9.198887 0.726107 -0.190279
C  9.21293 -0.96071 -1.580259
C  -9.208885 -0.962081 1.588504
C  9.798767 0.170212 -0.958909
C  -9.796437 0.165365 0.962474
H  0.669175 2.238605 0.880435
H  -0.673442 2.233307 -0.897826
H  1.095279 -1.948011 -0.227506
H  -1.093354 -1.948451 0.230617
H  3.022489 2.23163 1.739089
H  -3.027245 2.219024 -1.755075
H  3.400908 -1.961068 0.668113
H  -3.399427 -1.968958 -0.66366
H  6.372802 -0.913664 2.691024
H  4.929333 -1.919917 2.332623
H  -6.375268 -0.93478 -2.687482
H  -4.930262 -1.937742 -2.325857
H  7.556038 0.636251 1.605607
H  -7.558022 0.620072 -1.607877
H  7.559559 -2.390613 -1.516292
H  -7.55469 -2.39121 1.529039
H  9.646455 1.61632 0.664163
H  -9.647645 1.603495 -0.668008
H  9.676154 -1.397642 -2.471496
H  -9.670447 -1.394889 2.482611
H  10.715666 0.607678 -1.369867
H  -10.712989 0.604259 1.372685
