program: Gaussian 09
title: 000295333
version: EM64L-G09RevD.01
frameworkgroup: C1[X(C17H17Cl2NO2)]
method: RPBEPBE
basis: SDD
operation: Freq
keyword: #p
keyword: freq=noraman
keyword: PBEPBE/SDD
title: #p freq=noraman PBEPBE/SDD
converged: YES YES NO NO
title: Mulliken charges:
elementType: Cl Cl O O N C C C C C C C C C C C C C C C C C H H H H H H H H H H H H H H H H H
charge: -0.030487 -0.057016 -0.253238 -0.283507 -0.233852 -0.063255 0.356012 -0.686239 -0.680135 0.173800 -0.453750 -0.343865 -0.288197 -0.225244 -0.229067 -0.234424 0.493725 -0.297801 -0.306117 -0.203714 -0.233798 -0.106021 0.262164 0.222690 0.227350 0.226704 0.226623 0.221054 0.225774 0.249535 0.263766 0.255818 0.254575 0.232524 0.237552 0.233953 0.307502 0.280077 0.258530
chargesum: 0.00000
title: Mulliken charges with hydrogens summed into heavy atoms:
elementType: Cl Cl O O N C C C C C C C C C C C C C C C C C
charge: -0.030487 -0.057016 -0.253238 -0.283507 -0.233852 0.198908 0.356012 -0.009494 -0.006685 0.173800 0.059550 -0.088047 -0.033623 0.007280 0.008484 -0.000471 0.493725 -0.297801 0.001385 0.076363 0.024733 -0.106021
polarizability: 2.75193290e+02 -2.99585798e+01 2.27465490e+02 2.53647304e+01 1.62879948e+01 1.37783655e+02
1716.lowfreq: -11.4707 -6.4963 -5.2046 -0.0027 -0.0018 0.0007 10.8348 19.9122 25.1040
frequency: 9.7540 19.4397 25.0570 32.0883 49.0190 73.4608 75.5689 110.9669 120.5775 137.4776 166.0238 166.2680 200.0883 206.9565 214.2810 256.7116 271.0125 297.9950 315.0759 325.3465 334.3682 360.5853 384.5564 394.8984 413.9561 435.7066 442.0692 464.9952 496.3080 539.0088 546.5409 569.4080 578.1622 614.7729 617.4243 672.1341 683.9113 699.6695 704.8668 726.8383 771.3882 792.3959 822.1770 850.4874 858.4683 860.4385 923.0606 923.7822 932.5402 942.3911 944.5066 948.9508 973.1534 978.0802 990.9501 998.4788 1023.2690 1025.8502 1032.9328 1078.6054 1084.4055 1119.6831 1141.2969 1155.1506 1173.2247 1181.8567 1182.2095 1211.2044 1235.6883 1242.5832 1266.2623 1307.8282 1320.7772 1339.7246 1351.4262 1361.4690 1373.2625 1377.9671 1387.4300 1393.9389 1397.1857 1435.5559 1462.4483 1463.3439 1464.6723 1467.9730 1475.4789 1482.4764 1487.2833 1568.0793 1572.2368 1588.8920 1592.6040 1607.4751 2983.7259 2986.6959 3030.1940 3035.1881 3080.2229 3087.5246 3088.4830 3093.0903 3112.7947 3131.1280 3138.8167 3142.4871 3155.3137 3165.1410 3175.7828 3177.6197 3181.3970
redmass: 6.6310 5.9819 3.1434 7.3348 4.2124 6.5069 6.0716 7.6250 3.5776 5.9855 5.6755 11.6647 8.1927 2.6560 1.3144 1.0608 3.4429 3.5133 4.2215 5.9181 5.9681 7.8374 11.6707 4.4213 2.8847 2.6248 3.3156 2.7171 5.4388 5.4528 4.2088 2.8911 5.2130 7.1096 6.4541 6.7355 5.0354 4.4473 1.8134 6.7407 1.8631 7.3620 1.3638 1.2488 1.4123 2.8913 1.3118 1.4285 3.0775 2.7355 1.4049 1.3659 4.4781 1.4327 6.0576 1.3236 2.4985 2.6554 2.6346 1.5556 2.4274 1.9242 2.4858 1.3428 1.0541 2.0209 1.1322 2.0178 3.0875 1.5837 1.4015 1.4001 2.1040 1.3856 1.5751 3.6446 8.1926 1.2180 5.0606 1.4185 1.4602 2.1981 1.1067 1.0475 2.3551 1.0598 1.1526 1.9184 1.0613 8.3250 7.7372 6.3116 7.3623 6.2389 1.0350 1.0358 1.0599 1.0857 1.0996 1.1011 1.0986 1.1000 1.1052 1.0853 1.0920 1.0890 1.0936 1.0975 1.0949 1.0991 1.0935
irintensity: 0.6976 0.1543 0.0669 0.8963 0.5127 1.6825 1.6060 1.9365 0.2496 1.1235 0.2459 1.4459 1.5876 6.8877 1.5989 0.2399 2.7530 0.2420 1.8164 2.8331 2.9738 1.5868 3.0982 13.0375 0.7752 5.5604 7.1485 5.8541 3.7958 4.9945 9.3427 18.6877 16.3294 47.0579 1.1204 12.5913 13.5787 1.4193 63.9132 47.3425 25.3028 20.4187 59.5725 0.3871 23.6670 0.5383 1.7903 1.8614 4.0333 28.6517 0.6981 4.8497 17.5182 1.5436 1.2807 0.2187 24.0184 40.9398 47.1043 10.8665 24.6109 76.1740 12.6636 2.1591 0.1277 16.4713 1.7745 150.5388 41.5007 37.0246 51.8415 6.5957 85.7472 7.5496 13.1193 23.8731 2.3404 25.2698 4.5230 37.9400 8.3852 4.7038 28.8963 1.3219 301.7261 1.5696 36.4789 15.9376 22.4148 114.8716 231.7672 4.2135 8.1303 4.9184 22.0400 18.2530 25.2914 6.7965 2.2600 17.9430 65.5679 29.8351 9.1098 0.6456 17.7029 6.1969 22.2629 23.3021 3.1286 2.9946 0.2746
temp: 298.150 k
press: 1.00000 atm
elementType: 17 17 8 8 7 6 6 6 6 6 6 6 6 6 6 6 6 6 6 6 6 6 1 1 1 1 1 1 1 1 1 1 1 1 1 1 1 1 1
symmnumber: 1
zpe: 786329.1 jmol-1
zpe.correction: 0.299497 hartree
zpe.thermalcorrener: 0.321073 hartree
zpe.thermalcorrenthalpy: 0.322017 hartree
zpe.thermalcorrgfe: 0.244959 hartree
zpe.sumelectzpe: -1781.720156 hartree
zpe.sumelectthermal: -1781.698580 hartree
zpe.sumelectthermalent: -1781.697636 hartree
zpe.sumelectthermalfe: -1781.774694 hartree
dipole: -5.0956 0.6948 -0.0897
dipole: 5.1435
quadrupole: -138.9458 -143.8016 -139.0944
quadrupole: -1.4311 1.3576 -0.2438
quadrupole: 1.6681 -3.1877 1.5195 -1.4311 1.3576 -0.2438
hfenergy: -1782.0196526 hartree
pointgroup: C01 [X(C17H17Cl2N1O2)]
dipole: -1.9226081 -0.6246784 0.0916966 debye
polarizability: 252.4251802|62.2009001|189.9062704|-15.2251543|37.6580759|198.1109846 unknown
InChI: InChI=1S/C17H17Cl2NO2/c1-12(2)20(14-6-4-3-5-7-14)17(21)11-22-16-9-8-13(18)10-15(16)19/h3-10,12H,11H2,1-2H3
charge 0 multiplicity 1
39 atoms
Cl 2.081676 -1.563476 -2.683675
Cl 5.953871 1.998902 -0.897616
O  0.80643 -1.046632 -0.075071
O  -0.332029 1.073605 2.259594
N  -1.982077 0.225934 0.829164
C  -2.804487 1.479106 0.98465
C  -2.478328 -0.846067 -0.017846
C  -4.099122 1.224838 1.787371
C  -3.091346 2.123531 -0.388064
C  -0.756534 0.157117 1.48076
C  0.107995 -1.0931 1.227078
C  -3.426497 -1.766425 0.496621
C  -2.026222 -0.971054 -1.353629
C  -3.92216 -2.80245 -0.326076
C  -2.520924 -2.011761 -2.170083
C  -3.471747 -2.926367 -1.661253
C  1.979514 -0.290959 -0.188156
C  2.710345 -0.447357 -1.395674
C  2.472485 0.603911 0.794479
C  3.915018 0.239653 -1.623627
C  3.683689 1.299628 0.582613
C  4.389532 1.105055 -0.61743
H  -2.151817 2.147938 1.573674
H  -4.606941 2.18834 1.974746
H  -4.801499 0.575808 1.234375
H  -3.874999 0.761305 2.764264
H  -2.154368 2.329715 -0.934737
H  -3.619209 3.082536 -0.238982
H  -3.729734 1.477289 -1.016866
H  0.83601 -1.176025 2.053249
H  -0.499536 -2.008257 1.161693
H  -3.758464 -1.674719 1.5360
H  -1.275434 -0.273145 -1.734683
H  -4.651166 -3.514128 0.076756
H  -2.156546 -2.110274 -3.197967
H  -3.852612 -3.733661 -2.296309
H  1.892602 0.795408 1.703392
H  4.464877 0.098753 -2.557329
H  4.057452 1.990987 1.34259
