program: Gaussian 09
title: 000294418
version: EM64L-G09RevD.01
frameworkgroup: C1[X(C9H11NOS)]
method: RPBEPBE
basis: SDD
operation: Freq
keyword: #p
keyword: freq=noraman
keyword: PBEPBE/SDD
title: #p freq=noraman PBEPBE/SDD
converged: YES YES NO NO
title: Mulliken charges:
elementType: S O N C C C C C C C C C H H H H H H H H H H H
charge: 0.023001 -0.239377 -0.442847 0.485185 0.453276 -0.440536 -0.343680 -0.402850 -0.350878 -0.808087 0.281562 -0.855183 0.215279 0.307070 0.231489 0.231170 0.303709 0.232198 0.222194 0.232031 0.313379 0.259391 0.092502
chargesum: 0.00000
title: Mulliken charges with hydrogens summed into heavy atoms:
elementType: S O N C C C C C C C C C
charge: 0.115503 -0.239377 -0.139138 0.485185 0.453276 -0.225257 -0.036610 -0.171361 -0.119707 -0.121664 0.281562 -0.282413
polarizability: 1.95892317e+02 -5.12451875e+00 1.16184815e+02 4.32707641e+00 3.13414658e+00 7.49585267e+01
1716.lowfreq: -34.8874 -11.2227 -0.0006 0.0008 0.0022 1.6979 6.1955 33.1379 44.3746
frequency: -34.5896 32.9996 44.3543 73.1191 118.1148 137.5966 169.5095 212.7201 290.4195 313.7637 353.1764 376.6290 409.2085 481.6731 515.9106 561.3022 632.6298 635.2835 655.4186 717.3508 725.5531 766.7725 789.0782 820.6098 837.0222 856.2703 935.1061 942.3770 971.7482 989.5084 991.7672 1009.9747 1047.5334 1124.0932 1129.4505 1192.9379 1222.4963 1227.6300 1253.2003 1261.8290 1312.9977 1366.8902 1398.9024 1409.7526 1436.8586 1469.8194 1471.2314 1502.0846 1510.4416 1595.7731 1624.5599 1627.6917 2425.9947 2976.2906 3030.7818 3053.9953 3083.0969 3104.6366 3125.7605 3132.8026 3139.2558 3194.5808 3519.8658
redmass: 1.0368 4.5241 5.5428 5.1179 1.3628 4.3788 2.6609 5.5730 4.2431 3.5024 3.9124 3.3111 2.9341 3.6025 2.5844 5.9946 5.0585 1.2740 4.9602 2.9847 2.7727 4.6481 1.7242 1.4802 4.0499 1.2951 5.8861 1.3562 1.6619 1.4191 1.3247 2.8127 1.5427 1.3119 1.2823 1.1160 2.7117 2.2619 1.2016 2.0116 1.4128 4.7137 1.2370 3.7177 1.1274 1.0465 1.1637 1.7593 2.8667 5.3681 5.4162 6.4558 1.0384 1.0372 1.0635 1.0976 1.0987 1.0883 1.0910 1.1017 1.0955 1.0944 1.0763
irintensity: 0.6494 1.3558 0.7100 1.5133 23.5940 6.7788 8.2373 1.7544 1.5638 2.3498 1.4397 0.8928 0.0067 15.1996 38.7314 0.6091 2.6024 47.9755 16.1006 0.9298 1.5080 3.0425 1.8514 58.2102 0.8032 23.9851 2.7927 3.5159 3.3920 0.7228 4.7493 2.7540 11.5729 62.7110 23.4235 0.2946 3.4476 6.7698 6.0088 19.9851 24.4570 102.1481 2.8672 25.8475 34.9489 12.8198 63.9328 73.9387 245.8454 50.0765 155.4694 4.4297 33.7488 42.0110 22.9960 21.2938 20.4066 20.1822 20.8036 1.9874 18.7565 4.9087 11.1785
temp: 298.150 k
press: 1.00000 atm
elementType: 16 8 7 6 6 6 6 6 6 6 6 6 1 1 1 1 1 1 1 1 1 1 1
symmnumber: 1
zpe: 468578.5 jmol-1
zpe.correction: 0.178472 hartree
zpe.thermalcorrener: 0.190252 hartree
zpe.thermalcorrenthalpy: 0.191196 hartree
zpe.thermalcorrgfe: 0.138933 hartree
zpe.sumelectzpe: -876.716961 hartree
zpe.sumelectthermal: -876.705181 hartree
zpe.sumelectthermalent: -876.704237 hartree
zpe.sumelectthermalfe: -876.756501 hartree
dipole: 1.9624 -3.9316 -1.2294
dipole: 4.5629
quadrupole: -76.8733 -76.9964 -80.0864
quadrupole: 6.4399 6.5850 1.5988
quadrupole: 1.1121 0.9890 -2.1011 6.4399 6.5850 1.5988
hfenergy: -876.8954331 hartree
pointgroup: C01 [X(C9H11N1O1S1)]
dipole: -0.8283088 1.5549511 -0.3444856 debye
dipolederiv: -0.1246046 -0.1939973 0.0474004 -0.3116599 -0.0808055 -0.0072767 -0.0921086 0.0349058 -0.1325303 -0.6390967 -0.0818582 -0.0250656 0.5092712 -0.927852 -0.088111 -0.0174856 0.0302721 -0.3098623 -1.6388901 0.2348176 -0.0052073 0.4217819 -0.4073231 -0.0271597 0.0846248 -0.0136028 -0.2861791 1.0427973 0.0154445 -0.0640652 0.259926 -0.0005412 -0.002445 -0.1075995 0.0025567 0.0964025 0.338723 0.0749938 -0.0451118 0.1373588 -0.1006751 -0.0037586 -0.0538429 -0.0012681 -0.0337434 -0.1903344 -0.019562 -0.0085177 0.1068695 0.0548777 -0.0414769 -0.0074107 -0.0211769 -0.1899766 -0.2081887 0.0060603 -0.0056366 -0.1369607 -0.0523386 0.0012195 0.0132262 -0.0079082 -0.1497193 -0.0850068 -0.0068669 -0.0142157 -0.2216784 0.0886987 -0.0075228 0.0129678 -0.022757 -0.1595585 -0.1125521 -0.0044794 -0.0082267 0.1447784 0.1534891 -0.0378616 -0.0234426 -0.0294191 -0.1637408 -0.1171379 -0.0408539 0.0217481 -0.1436524 0.0716212 0.0115036 0.0354106 0.0040345 0.0680382 1.5708535 -0.1173729 0.0865554 -0.8943085 1.194945 0.1058191 0.0345267 -0.0319886 0.039576 -0.1198299 -0.082552 -0.0122706 -0.0091303 0.0191039 0.0454696 0.1058263 -0.0430573 0.266906 0.0207724 -0.1117314 0.0277636 -0.0973396 -0.0774616 0.0333686 0.0237255 0.0333063 0.1570186 0.1456273 0.0608503 0.0059723 0.0349727 0.0717227 0.0115152 0.0019868 0.0022841 0.1765957 -0.0212451 0.1108017 0.0036447 0.1100043 -0.0337719 0.0082086 0.0061876 0.0057363 0.150115 0.0383593 -0.0763423 0.0163612 -0.0900186 -0.0751188 0.0277879 0.0201578 0.0280209 0.1394192 0.1648613 0.0102945 0.0267656 -0.0588634 0.0860206 0.0089307 0.0247249 0.0041816 0.2778432 -0.0120804 -0.0127009 0.0272119 -0.0330046 0.0598086 0.1029503 0.1061494 0.0910155 -0.0762981 0.0025187 0.0444624 0.005271 0.1658456 -0.0959548 0.0049875 -0.0056643 0.01537 0.1068327 -0.0389471 -0.0385287 -0.0305304 -0.075532 0.0191928 -0.1092032 -0.0991922 -0.1021284 -0.0102365 0.030065 0.0191012 0.0114077 0.0585363 0.0644244 -0.0620326 0.0240975 -0.0368505 0.0621948 0.0058443 0.0368831 -0.0952063 -0.0496354 -0.0556113 0.1027353 -0.053978 0.0766146 -0.0591049 -0.0525084 0.1731367 0.033952 0.1724392 0.0235491 -0.0776476 -0.0328874 -0.0181412 0.0300079 unknown
polarizability: 196.3443746|-1.0846223|116.1130662|0.4060175|1.2560562|74.5782174 unknown
InChI: InChI=1S/C9H11NOS/c1-7-2-4-8(5-3-7)10-9(11)6-12/h2-5,10,12H,6H2,1H3
charge 0 multiplicity 1
23 atoms
S  4.499379 0.605748 1.166463
O  2.163734 -1.61375 -0.313889
N  1.240018 0.551067 -0.35393
C  -0.153815 0.291287 -0.188691
C  -2.972573 -0.076055 0.137525
C  -1.034223 1.40423 -0.205309
C  -0.685001 -1.013993 -0.009469
C  -2.422082 1.217747 -0.043674
C  -2.075899 -1.176119 0.15012
C  -4.466958 -0.283008 0.311671
C  2.298605 -0.35873 -0.392427
C  3.669119 0.307773 -0.521661
H  -0.635591 2.418184 -0.344728
H  -0.009284 -1.870845 -0.000908
H  -3.085359 2.090547 -0.059151
H  -2.473964 -2.189163 0.28771
H  1.483938 1.538278 -0.467176
H  -4.696803 -0.763838 1.281199
H  -5.015876 0.673657 0.273478
H  -4.877852 -0.938104 -0.479501
H  4.351149 -0.38949 -1.029158
H  3.641834 1.261035 -1.076686
H  3.548601 1.494245 1.646793
