program: Gaussian 09
title: 000294419
version: EM64L-G09RevD.01
frameworkgroup: C1[X(C11H12N2O3)]
method: RPBEPBE
basis: SDD
operation: Freq
keyword: #p
keyword: freq=noraman
keyword: PBEPBE/SDD
title: #p freq=noraman PBEPBE/SDD
converged: YES YES NO NO
title: Mulliken charges:
elementType: O O O N N C C C C C C C C C C C H H H H H H H H H H H H
charge: -0.211276 -0.222292 -0.221457 -0.064542 0.020816 -0.592636 0.164166 0.272210 0.248753 -0.762532 -0.359387 -0.329914 0.373721 -0.339021 -0.348620 -0.756470 0.272256 0.243312 0.231821 0.287234 0.251310 0.256377 0.262519 0.286138 0.286455 0.251115 0.262194 0.237750
chargesum: 0.00000
title: Mulliken charges with hydrogens summed into heavy atoms:
elementType: O O O N N C C C C C C C C C C C
charge: -0.211276 -0.222292 -0.221457 -0.064542 0.020816 -0.077069 0.164166 0.272210 0.248753 0.007834 -0.103010 -0.067395 0.373721 -0.052883 -0.062164 -0.005411
polarizability: 2.73048527e+02 9.31023210e+00 1.37792985e+02 -3.72117834e+00 2.10590560e+00 8.50299764e+01
1716.lowfreq: -6.8914 -0.0003 -0.0003 0.0005 2.2622 6.2965 26.9335 32.0324 36.1434
frequency: 26.6772 32.0233 36.0806 60.0285 73.6617 75.4524 105.9047 149.4952 158.2513 182.6000 233.9843 251.9931 296.1211 323.3772 387.1024 408.6376 414.7209 455.7037 475.2758 497.5011 518.3209 536.4533 616.7518 621.6394 638.0161 668.3950 726.3246 741.9552 787.0475 799.5896 819.2470 833.6584 854.6503 889.5509 949.6980 980.1665 981.1054 986.5364 996.8049 1030.9342 1050.1489 1094.8820 1105.0738 1155.2233 1167.6515 1175.1138 1223.4348 1246.0423 1265.6546 1289.4855 1304.0475 1347.5294 1370.6254 1378.1999 1383.4018 1421.9083 1430.1228 1442.7614 1453.1306 1454.9657 1463.0946 1472.7428 1575.2799 1602.6970 1637.9256 1674.2411 2976.4378 2981.7469 2984.1628 3060.4241 3064.1616 3069.5434 3110.5705 3124.7960 3151.1347 3160.5070 3181.7688 3185.6037
redmass: 5.0234 4.5027 5.2643 4.7071 4.1132 5.9727 1.1068 1.8187 2.4269 2.6234 7.2967 3.7130 3.8495 3.6505 3.1932 4.0033 3.8559 2.3150 3.5044 5.8124 3.6433 4.3476 5.4836 5.3319 5.1717 4.5279 5.3980 5.7607 4.2875 4.2393 2.0760 1.2441 1.7126 2.6686 1.7603 1.3437 1.3776 1.3524 2.8882 1.7635 1.9529 3.2145 1.2817 1.7521 2.1671 1.3369 5.3051 2.4967 2.6988 1.2904 1.9925 6.6443 1.2301 1.2537 7.4810 1.1230 4.3508 1.0671 1.0596 1.0700 1.3751 1.6354 8.0621 6.4686 7.6076 8.9286 1.0598 1.0377 1.0411 1.0951 1.0962 1.0955 1.1001 1.1005 1.0901 1.0894 1.0952 1.0967
irintensity: 0.5282 2.7661 1.4140 3.0963 0.9384 0.7643 0.1754 2.5932 8.1217 8.1565 1.8916 2.0269 1.5710 0.1368 0.3793 2.0207 5.4372 5.3418 11.7239 2.8318 11.3775 1.2193 49.0458 8.5744 27.3800 31.1427 2.8772 15.5022 23.0870 22.2469 2.3469 0.5009 70.2938 1.5366 20.9968 3.5258 1.6042 0.0162 1.3528 43.8826 11.8342 17.3153 25.2132 39.0446 259.3172 35.9174 549.1000 81.9437 10.5709 1.7944 96.8062 66.6024 64.4016 60.8251 54.4542 29.8931 19.1375 23.6717 24.4282 10.4266 10.2933 34.0236 10.2528 228.0466 95.3526 274.0000 18.4688 7.1343 8.4407 6.5185 15.4739 11.8127 6.8213 10.8621 3.1161 2.8082 0.5205 3.5530
temp: 298.150 k
press: 1.00000 atm
elementType: 8 8 8 7 7 6 6 6 6 6 6 6 6 6 6 6 1 1 1 1 1 1 1 1 1 1 1 1
symmnumber: 1
zpe: 555412.3 jmol-1
zpe.correction: 0.211545 hartree
zpe.thermalcorrener: 0.227546 hartree
zpe.thermalcorrenthalpy: 0.228490 hartree
zpe.thermalcorrgfe: 0.165412 hartree
zpe.sumelectzpe: -760.282930 hartree
zpe.sumelectthermal: -760.266929 hartree
zpe.sumelectthermalent: -760.265985 hartree
zpe.sumelectthermalfe: -760.329063 hartree
dipole: -8.8479 -2.9902 0.8521
dipole: 9.3783
quadrupole: -110.7780 -94.5108 -91.0482
quadrupole: 5.3896 1.5595 -1.4870
quadrupole: -11.9990 4.2682 7.7308 5.3896 1.5595 -1.4870
hfenergy: -760.4944751 hartree
pointgroup: C01 [X(C11H12N2O3)]
dipole: 3.472065 1.2013071 0.340049 debye
polarizability: 272.0046175|9.9653619|134.843335|14.6094943|-11.4566176|89.0235359 unknown
InChI: InChI=1S/C11H12N2O3/c1-8(7-9(2)14)12-10-3-5-11(6-4-10)13(15)16/h3-6H,7H2,1-2H3
charge 0 multiplicity 1
28 atoms
O  4.039363 -1.504499 0.715578
O  -5.154329 0.6839 -0.469746
O  -4.726604 -1.527656 -0.092986
N  1.245508 0.788289 -0.35035
N  -4.340804 -0.305757 -0.280298
C  3.583914 0.865475 0.220602
C  2.128926 0.645726 0.599906
C  -0.13165 0.514839 -0.256868
C  4.429887 -0.428631 0.194713
C  1.838586 0.272335 2.040064
C  -1.069304 1.564702 -0.48716
C  -0.608243 -0.816813 -0.05768
C  -2.894928 -0.025297 -0.276254
C  -2.447236 1.30136 -0.485414
C  -1.985426 -1.088639 -0.069831
C  5.766802 -0.316968 -0.522756
H  3.635198 1.342849 -0.774322
H  4.075689 1.553226 0.940251
H  2.314055 0.997744 2.726396
H  2.293435 -0.714717 2.246999
H  0.758997 0.228297 2.253161
H  -0.695053 2.576741 -0.667544
H  0.11418 -1.626652 0.087907
H  -3.182673 2.093436 -0.648468
H  -2.371279 -2.100163 0.081887
H  5.594078 -0.33265 -1.616824
H  6.413335 -1.168104 -0.259163
H  6.275576 0.635726 -0.289299
