program: Gaussian 09
title: 000294441
version: EM64L-G09RevD.01
frameworkgroup: C1[X(C18H23NO6)]
method: RPBEPBE
basis: SDD
operation: Freq
keyword: #p
keyword: freq=noraman
keyword: PBEPBE/SDD
title: #p freq=noraman PBEPBE/SDD
converged: YES YES NO NO
title: Mulliken charges:
elementType: O O O O O O N C C C C C C C C C C C C C C C C C C H H H H H H H H H H H H H H H H H H H H H H H
charge: -0.192822 -0.207653 -0.219266 -0.209000 -0.254798 -0.260528 -0.096545 -0.240932 -0.328269 -0.301139 0.216880 0.198394 0.162853 0.225345 0.180132 -0.320690 -0.403086 -0.414153 -0.774451 -0.765845 -0.184010 -0.382656 -0.173234 -0.514805 -0.506691 0.293558 0.296019 0.308551 0.278578 0.257711 0.245127 0.215982 0.274190 0.237403 0.250658 0.279827 0.254418 0.270445 0.242992 0.241442 0.239906 0.234017 0.228406 0.248060 0.200574 0.247443 0.208315 0.213349
chargesum: 0.00000
title: Mulliken charges with hydrogens summed into heavy atoms:
elementType: O O O O O O N C C C C C C C C C C C C C C C C C C
charge: -0.192822 -0.207653 -0.219266 -0.209000 -0.254798 -0.260528 -0.096545 0.052626 -0.032249 0.007413 0.216880 0.198394 0.162853 0.225345 0.180132 -0.042113 0.099752 0.076018 -0.006564 0.002011 0.057432 -0.142750 0.060783 0.162235 0.162416
polarizability: 2.10098347e+02 -1.15411726e+01 2.24891724e+02 -1.35796555e+01 1.70188680e+00 1.99590452e+02
1716.lowfreq: -8.1913 -7.4994 0.0004 0.0005 0.0006 0.9651 17.9789 20.8942 31.1671
frequency: 17.7873 20.7569 31.0104 41.2355 49.7494 53.6181 62.2097 65.2344 70.1233 72.6350 86.7196 91.6687 106.7835 113.0883 114.1578 127.5252 133.2218 145.2607 161.9951 180.2293 182.7617 197.7196 210.1188 232.1109 245.0935 273.5098 281.0130 310.2387 345.5504 364.4940 393.4109 399.4787 405.7528 412.9028 448.8440 479.4900 505.1299 517.6707 549.5826 552.6490 571.4712 581.4835 615.9141 633.7400 665.9256 728.0473 755.5712 763.9047 795.6027 805.6972 805.8587 859.8604 865.0513 878.5030 895.5025 912.4070 946.0702 959.6078 966.0665 967.2152 972.5872 985.4389 1003.3621 1010.7134 1016.3133 1028.4766 1038.9492 1044.4669 1049.4052 1052.8691 1094.6262 1104.1682 1112.2780 1117.0853 1135.6504 1152.7171 1158.6672 1169.2254 1177.0731 1177.1814 1208.5493 1219.9586 1227.1594 1246.1120 1261.5438 1273.9589 1289.9513 1294.3564 1305.6789 1310.7632 1330.0646 1343.4019 1363.8350 1368.9480 1380.5436 1412.2266 1414.9780 1419.4915 1435.1498 1436.6869 1437.4996 1443.5034 1447.8082 1451.4100 1452.6068 1458.1697 1462.6323 1466.6839 1485.8724 1563.8202 1584.0998 1595.2765 1621.0325 1621.7146 1627.5600 2906.0435 2940.4609 2948.1856 2950.9193 2968.4938 2987.2667 2988.9658 3010.3325 3018.7995 3034.1857 3052.9269 3058.9221 3070.9398 3071.3577 3076.8029 3112.9996 3115.1227 3123.3035 3126.8906 3128.2345 3144.7594 3162.2337 3174.7238
redmass: 4.5975 5.3018 4.1926 4.3585 4.0664 4.4169 4.4207 3.8575 5.3115 3.6554 5.1226 2.1579 1.3772 2.0195 2.0407 1.5963 2.8253 2.5821 2.3391 2.7271 2.3516 5.1772 3.3413 3.8081 3.7337 4.7062 6.6595 4.4779 4.6616 2.3452 3.5462 4.0604 3.2990 2.8119 4.4834 3.4747 3.5382 4.1525 3.5137 3.8355 3.0100 4.2293 5.8760 5.0754 3.7586 4.4059 1.9318 3.1507 2.8280 4.4206 3.7828 4.9366 4.4067 3.4416 3.7023 1.3136 2.2406 2.1697 1.6562 4.9102 2.1119 2.3238 2.2855 1.3772 2.3431 2.5031 3.1415 2.6964 3.0435 3.2343 1.7174 2.4906 1.2928 1.5568 2.7138 1.5513 1.4650 1.0779 2.1857 2.3525 1.7256 1.7585 1.6800 1.1901 1.2461 1.3038 1.5839 1.5491 4.5946 1.4057 1.3486 1.3228 1.4556 1.2239 1.2316 1.0730 1.1180 1.8961 1.0861 1.1425 1.1186 1.0575 1.0685 1.0655 1.0589 2.0780 1.0569 1.0591 1.0512 5.9655 5.5705 9.3080 7.8766 7.9933 8.4886 1.0668 1.0337 1.0379 1.0805 1.0617 1.0397 1.0366 1.0828 1.1026 1.0914 1.0956 1.0982 1.0866 1.0881 1.0958 1.1019 1.0980 1.1010 1.0889 1.1021 1.0893 1.0948 1.1016
irintensity: 0.2643 0.3447 0.4556 0.6811 0.6493 4.8871 4.5552 2.7725 4.3498 8.5051 0.6253 2.6089 6.3320 1.4845 4.1038 1.7077 2.1358 3.5482 2.0364 1.0721 2.4542 0.8387 6.6800 21.6500 3.8674 0.6346 3.1863 2.0106 2.1946 9.2164 12.2591 5.8148 13.6240 3.1304 6.8073 4.4783 11.3447 7.4473 23.1573 13.1312 2.8064 4.8870 1.8736 1.8539 16.9195 8.7180 23.6835 8.9071 11.2575 8.3364 31.7596 7.6269 26.6193 8.0514 10.4958 1.1667 8.4719 0.7566 2.0755 3.2741 17.8853 4.1116 10.6440 6.5298 43.5961 5.7754 37.0998 10.4378 50.6578 54.7049 1.8066 18.1428 2.3796 12.6950 28.7862 16.2303 21.8139 1.0555 122.0024 62.7793 62.8237 15.5101 80.3265 20.6295 23.0156 15.5589 39.4392 22.4804 2.8501 21.6603 24.4871 24.3695 4.1195 75.8872 78.6107 13.9174 11.7499 24.2382 22.9603 5.9388 3.9443 19.8075 29.1489 21.3981 15.5592 37.5842 6.6052 4.4048 19.4530 10.7881 37.5986 186.2057 65.4702 75.1597 68.2977 25.5333 58.7079 51.7165 20.1731 34.6616 1.5943 2.6597 6.8491 75.6611 8.1862 34.2368 14.6506 5.0462 1.5031 5.7926 34.2879 20.4020 11.0941 11.7771 10.3367 9.3128 7.3834 21.2300
temp: 298.150 k
press: 1.00000 atm
elementType: 8 8 8 8 8 8 7 6 6 6 6 6 6 6 6 6 6 6 6 6 6 6 6 6 6 1 1 1 1 1 1 1 1 1 1 1 1 1 1 1 1 1 1 1 1 1 1 1
symmnumber: 1
zpe: 993278.5 jmol-1
zpe.correction: 0.378320 hartree
zpe.thermalcorrener: 0.406260 hartree
zpe.thermalcorrenthalpy: 0.407204 hartree
zpe.thermalcorrgfe: 0.316406 hartree
zpe.sumelectzpe: -1203.842461 hartree
zpe.sumelectthermal: -1203.814521 hartree
zpe.sumelectthermalent: -1203.813577 hartree
zpe.sumelectthermalfe: -1203.904375 hartree
dipole: -1.7177 -1.9141 -0.8176
dipole: 2.6986
quadrupole: -138.2832 -135.6497 -162.6495
quadrupole: -6.5292 -7.6616 2.9086
quadrupole: 7.2442 9.8778 -17.1220 -6.5292 -7.6616 2.9086
hfenergy: -1204.2207811 hartree
pointgroup: C01 [X(C18H23N1O6)]
dipole: -0.8180551 -0.6076737 0.29793 debye
polarizability: 202.872222|-15.3980472|221.663001|-4.3791155|-11.6565472|210.0453001 unknown
InChI: InChI=1S/C18H23NO6/c1-11(20)16(14(22)9-24-3)18(13-7-5-6-8-19-13)17(12(2)21)15(23)10-25-4/h5-8,16-18H,9-10H2,1-4H3
charge 0 multiplicity 1
48 atoms
O  3.074048 0.407524 0.33953
O  -2.901546 -1.01508 -0.828821
O  1.455922 0.406693 -3.031154
O  -1.452359 3.175757 -0.63958
O  2.479732 1.598104 2.843749
O  -3.255565 0.964822 2.224387
N  -0.156974 -1.394247 1.153744
C  -0.188388 0.191757 -0.754768
C  1.020957 1.207388 -0.752745
C  -1.457333 0.814371 -0.068337
C  0.195083 -1.160064 -0.147588
C  1.975616 1.006187 0.456221
C  -2.577651 -0.217284 0.091743
C  1.799259 1.173373 -2.092292
C  -1.90277 2.031233 -0.924118
C  0.909503 -2.11104 -0.916885
C  1.484022 1.570859 1.797641
C  -3.304951 -0.26929 1.448281
C  2.977042 2.118349 -2.226413
C  -2.817983 1.806327 -2.11283
C  1.276661 -3.335574 -0.321518
C  0.206079 -2.582528 1.720215
C  0.922812 -3.580153 1.025904
C  2.762207 0.28031 3.432847
C  -4.260466 1.952741 1.816567
H  -0.412853 0.002263 -1.821793
H  0.603145 2.233119 -0.658299
H  -1.208099 1.200796 0.932735
H  1.163064 -1.881653 -1.956264
H  1.161619 2.618802 1.648643
H  0.587816 0.979057 2.100758
H  -4.345947 -0.619199 1.283722
H  -2.766966 -1.019351 2.05635
H  2.789989 3.085784 -1.727395
H  3.215865 2.275359 -3.28964
H  3.850327 1.656481 -1.727733
H  -2.825252 2.7025 -2.751844
H  -2.519764 0.914719 -2.691097
H  -3.850333 1.607264 -1.764417
H  1.826626 -4.086498 -0.898213
H  -0.098784 -2.730679 2.762813
H  1.18823 -4.51741 1.524492
H  3.418402 0.477755 4.294694
H  3.277062 -0.376603 2.709197
H  1.825539 -0.204421 3.780722
H  -4.159827 2.791925 2.521367
H  -5.28438 1.530494 1.882601
H  -4.08984 2.327758 0.78612
