program: Gaussian 09
title: 000294410
version: EM64L-G09RevD.01
frameworkgroup: C1[X(C11H13NO3S)]
method: RPBEPBE
basis: SDD
operation: Freq
keyword: #p
keyword: freq=noraman
keyword: PBEPBE/SDD
title: #p freq=noraman PBEPBE/SDD
converged: YES YES NO NO
title: Mulliken charges:
elementType: S O O O N C C C C C C C C C C C H H H H H H H H H H H H H
charge: 0.031802 -0.292234 -0.256813 -0.228141 -0.444340 0.500996 0.237039 -0.339133 -0.439607 -0.353185 -0.320232 0.181454 0.288385 -0.219969 -0.858418 -0.675222 0.312069 0.220884 0.272158 0.271437 0.308646 0.229922 0.229845 0.316932 0.262290 0.213361 0.228785 0.228734 0.092553
chargesum: 0.00000
title: Mulliken charges with hydrogens summed into heavy atoms:
elementType: S O O O N C C C C C C C C C C C
charge: 0.124355 -0.292234 -0.256813 -0.228141 -0.135694 0.500996 0.237039 -0.027063 -0.218723 -0.081027 -0.048795 0.181454 0.288385 0.239798 -0.279196 -0.004342
polarizability: 2.71614557e+02 -1.80409776e+00 1.43176757e+02 2.95225897e+00 4.02575842e+00 9.07452703e+01
1716.lowfreq: -10.1931 -3.4893 -1.7261 -0.0013 -0.0006 0.0003 18.2126 34.7215 35.3203
frequency: 17.8909 34.7148 35.2351 59.4023 75.5990 82.6417 100.0566 119.9732 137.0718 162.4316 202.5416 242.5707 251.8383 263.8174 328.8012 334.8521 354.0444 404.6093 413.5045 480.3196 512.4350 541.9393 603.1348 630.3066 642.2426 679.7224 690.4574 724.5118 760.4905 782.9874 790.7767 798.4198 831.6417 839.4152 848.3722 888.2511 934.9965 969.5404 975.2019 1004.4188 1014.1436 1023.5785 1063.4645 1112.5086 1122.8969 1126.0986 1136.7143 1183.9965 1228.7676 1247.7259 1249.8287 1255.3528 1265.0213 1305.6917 1359.2005 1370.8060 1399.8985 1419.8177 1439.3178 1464.1381 1473.9353 1486.9802 1491.6228 1509.4147 1583.5694 1619.0904 1620.5764 1632.6722 2418.3136 2994.8914 3009.4782 3034.6244 3067.1670 3091.7370 3105.7476 3113.4923 3136.0811 3158.0468 3178.1569 3200.0681 3517.4615
redmass: 4.9181 6.3801 4.0236 3.3729 3.4154 5.9834 3.0897 1.4720 3.9960 3.0881 4.9866 4.9353 1.3895 3.7066 5.2173 6.4399 3.6711 3.8711 2.9758 4.9798 3.1573 4.2036 7.2477 6.7959 1.2021 4.1574 6.1656 2.5573 4.2467 2.5675 2.9716 1.1045 3.6424 1.4319 4.5063 1.4800 6.4547 1.6526 1.3679 3.3414 1.3332 2.2744 4.7976 2.2154 1.3609 1.3336 1.4688 1.1538 2.1967 2.6320 1.1396 1.2094 2.1764 1.3931 1.4181 4.8742 1.2708 4.2467 1.1514 1.0405 1.0595 1.0985 1.9460 2.7684 6.0410 6.7477 7.5891 5.9908 1.0385 1.0357 1.0581 1.0632 1.1064 1.0985 1.1026 1.0904 1.1020 1.0911 1.0944 1.0951 1.0763
irintensity: 0.9543 0.0145 0.4933 0.1137 3.0736 1.6824 6.6990 26.2793 0.1767 2.7082 4.4773 10.7135 0.9892 3.8056 1.4907 4.3600 6.6898 14.3533 0.0375 5.0153 21.4224 3.5133 2.5764 3.5778 52.1997 31.8538 15.8831 1.5212 13.1421 5.4782 6.3461 1.7417 3.2324 30.2250 5.3405 51.6332 2.4125 8.9553 0.0718 28.8519 0.5907 35.4299 414.8668 3.2825 70.7801 23.0094 5.6580 136.8360 40.2834 291.1700 3.3924 32.1991 113.7011 41.5056 2.7599 257.3232 20.0704 39.9988 39.9413 12.2201 6.3858 15.0744 71.3036 259.3439 109.6059 197.8150 145.3513 125.3988 34.6398 23.0825 22.3732 20.8002 7.5763 33.2606 46.5903 18.8555 1.6600 1.4784 2.1394 3.9695 11.8858
temp: 298.150 k
press: 1.00000 atm
elementType: 16 8 8 8 7 6 6 6 6 6 6 6 6 6 6 6 1 1 1 1 1 1 1 1 1 1 1 1 1
symmnumber: 1
zpe: 578892.5 jmol-1
zpe.correction: 0.220489 hartree
zpe.thermalcorrener: 0.237322 hartree
zpe.thermalcorrenthalpy: 0.238267 hartree
zpe.thermalcorrgfe: 0.172789 hartree
zpe.sumelectzpe: -1104.285592 hartree
zpe.sumelectthermal: -1104.268758 hartree
zpe.sumelectthermalent: -1104.267814 hartree
zpe.sumelectthermalfe: -1104.333291 hartree
dipole: 0.7625 -5.8563 -1.7673
dipole: 6.1645
quadrupole: -97.2845 -103.5936 -101.8603
quadrupole: 2.3343 6.9559 0.3107
quadrupole: 3.6283 -2.6808 -0.9475 2.3343 6.9559 0.3107
hfenergy: -1104.5060802 hartree
pointgroup: C01 [X(C11H13N1O3S1)]
dipole: -0.3352632 -2.3449183 0.5205503 debye
polarizability: 271.6340281|-1.2531328|143.4766648|-2.6905088|0.1600477|90.4258914 unknown
InChI: InChI=1S/C11H13NO3S/c1-2-15-11(14)8-3-5-9(6-4-8)12-10(13)7-16/h3-6,12,16H,2,7H2,1H3
charge 0 multiplicity 1
29 atoms
S  5.865901 -0.967527 -1.294731
O  -3.704277 -0.466846 -0.035453
O  -3.330758 1.822923 -0.276256
O  3.789147 1.475873 0.240522
N  2.705403 -0.611708 0.350686
C  1.335461 -0.251429 0.233609
C  -1.436917 0.31047 0.009483
C  0.898491 1.09043 0.054393
C  0.377955 -1.303115 0.301293
C  -0.478428 1.354078 -0.055798
C  -0.993655 -1.025953 0.190461
C  -2.877692 0.661163 -0.115222
C  3.835178 0.218045 0.333955
C  -5.169575 -0.203805 -0.154459
C  5.153402 -0.551052 0.421498
C  -5.871584 -1.552901 -0.039485
H  1.634838 1.89385 0.008329
H  0.712899 -2.339231 0.441418
H  -0.834715 2.380045 -0.195086
H  -1.730679 -1.83158 0.241931
H  2.881161 -1.612706 0.471235
H  -5.463073 0.497709 0.647428
H  -5.355807 0.290392 -1.125293
H  5.912743 0.105389 0.869875
H  5.078956 -1.479902 1.012036
H  -6.964751 -1.413757 -0.125082
H  -5.545674 -2.237251 -0.84158
H  -5.658079 -2.027952 0.933497
H  4.83393 -1.808752 -1.685201
