program: Gaussian 09
title: 000022654
version: EM64L-G09RevD.01
frameworkgroup: C1[X(C19H19NO5)]
method: RPBEPBE
basis: SDD
operation: Freq
keyword: #p
keyword: freq=noraman
keyword: PBEPBE/SDD
title: #p freq=noraman PBEPBE/SDD
converged: YES YES NO NO
title: Mulliken charges:
elementType: O O O O O N C C C C C C C C C C C C C C C C C C C H H H H H H H H H H H H H H H H H H H
charge: -0.261160 -0.264427 -0.290286 -0.302431 -0.308583 -0.035563 0.421401 0.193192 -0.589559 -0.069844 -0.491175 -0.573118 -0.492737 0.184774 0.165807 0.446956 -0.585203 -0.550395 -0.205297 0.246240 0.279959 0.015374 -0.525519 -0.527565 -0.524169 0.225952 0.232911 0.219919 0.233957 0.263732 0.292420 0.291821 0.287239 0.241765 0.234712 0.261627 0.212488 0.228195 0.250152 0.229340 0.221511 0.256851 0.225332 0.233404
chargesum: 0.00000
title: Mulliken charges with hydrogens summed into heavy atoms:
elementType: O O O O O N C C C C C C C C C C C C C C C C C C C
charge: -0.261160 -0.264427 -0.290286 -0.302431 -0.308583 -0.035563 0.421401 0.193192 -0.130696 -0.069844 -0.037299 -0.309386 -0.200317 0.184774 0.165807 0.446956 -0.293382 -0.263156 0.271180 0.246240 0.279959 0.015374 0.176791 0.173438 0.191417
polarizability: 3.27347540e+02 -5.28674868e+00 2.60369069e+02 -1.03778790e+01 -3.30404104e+00 1.48920752e+02
1716.lowfreq: -6.8876 -0.0007 -0.0005 -0.0004 1.8177 3.5519 24.2992 39.1551 49.0895
frequency: 24.1835 39.1141 49.0627 66.7477 70.0956 77.3570 85.7296 92.4966 108.9990 124.4687 141.8335 149.8911 159.3615 171.0393 193.0964 203.1654 221.2354 232.5855 243.5610 249.8037 286.0714 294.3624 313.1872 332.6047 343.7431 367.1021 395.7773 418.6865 434.4488 442.4751 505.8750 518.1454 527.6476 531.5019 582.6840 603.9232 638.5082 651.7251 669.3844 676.9998 693.7384 713.9901 728.1142 759.1081 771.6948 783.0304 794.3775 833.9952 867.5622 870.7092 873.5984 888.2395 901.6341 915.0608 927.5857 937.4657 940.6199 972.8941 975.2249 1020.5297 1034.9603 1042.4760 1056.4540 1069.3568 1105.2199 1111.6481 1112.4606 1113.4878 1125.8958 1147.9348 1152.8925 1154.2162 1159.2336 1163.1718 1172.9149 1207.6633 1215.1118 1227.8543 1241.9721 1275.3987 1305.4007 1323.4246 1343.9381 1354.2898 1361.1473 1390.4710 1398.1639 1417.2110 1422.4976 1434.1088 1434.7590 1450.0114 1452.2239 1455.3045 1457.4537 1459.9761 1465.1242 1472.9100 1476.8483 1484.0141 1486.6765 1487.0713 1540.1696 1564.0245 1602.5115 1611.0539 1617.6192 2947.5241 2967.3323 2969.9043 2971.6728 2978.6257 3004.2728 3048.3558 3053.5914 3066.6633 3077.7738 3079.7611 3106.2045 3119.7498 3121.6147 3124.0938 3166.6563 3166.9673 3179.6020 3185.2451
redmass: 5.0236 4.3617 4.8687 3.4060 2.7451 2.8637 2.7053 3.2256 3.7411 4.3263 2.1231 1.2768 1.4775 1.1841 3.8534 3.4418 3.7612 5.0061 4.6366 4.9562 6.2076 3.9640 4.7537 4.6697 4.3520 5.2550 5.8251 3.7291 5.2671 5.3685 5.0773 5.4305 5.7582 4.2054 5.5219 5.3097 5.3339 5.1424 4.4501 8.7221 6.0066 5.9992 4.1017 3.7910 5.5143 4.9948 5.1530 7.4976 5.2311 1.4855 3.1202 1.6229 1.7167 1.3490 5.0844 2.5127 8.8143 5.1971 5.6085 2.6858 5.0265 3.0233 2.8816 1.4798 2.8130 1.2399 1.2407 1.2536 1.0627 1.4159 1.3052 1.2652 1.4543 1.7563 3.1926 1.4629 1.3546 2.4713 1.3891 3.8798 1.5160 4.5075 1.7330 7.2524 1.2952 3.0130 5.3045 1.4131 3.3312 1.3921 1.2393 1.1380 1.1322 1.2193 1.0626 1.1272 1.8572 2.1203 1.0675 1.0550 1.0825 1.3884 7.0277 8.0456 7.0482 8.3933 9.0469 1.0693 1.0638 1.0312 1.0336 1.0295 1.0593 1.0959 1.0938 1.1040 1.0991 1.1052 1.1122 1.1025 1.1034 1.1042 1.0927 1.0918 1.0922 1.0925
irintensity: 0.3072 1.1364 1.9684 2.7602 8.3466 8.1932 0.6166 6.2037 9.9174 1.1388 0.5136 0.6731 2.3445 0.2496 1.2668 3.7218 2.7042 1.3082 7.8948 9.4180 10.6302 5.8034 4.5105 3.0672 2.1693 1.7815 3.6048 4.5054 1.9050 7.1189 0.5617 1.5881 5.8906 2.2704 8.0178 3.7075 9.4118 6.2234 32.8454 0.4483 9.0136 4.0322 2.0632 10.5618 7.8730 34.4148 8.3434 31.0676 11.3766 13.5690 6.9043 44.1233 4.1402 0.9420 39.9555 6.6990 72.9744 64.9874 151.3293 67.6704 136.8399 6.3868 22.0673 7.1642 28.8257 11.4692 7.0933 1.4740 1.9587 2.5412 4.5032 2.5269 12.9359 37.9729 30.5390 15.2053 28.9413 30.1824 37.1610 187.9300 41.7924 311.8033 83.3648 18.1503 12.5997 74.1769 36.8937 9.7256 2.8833 10.3905 33.9125 17.1561 3.6086 15.3625 14.8215 13.6820 25.3011 100.9587 4.9081 19.0885 30.7478 36.9731 132.5229 32.9487 9.8275 2.2639 30.7763 44.9395 31.6603 62.8280 98.7930 66.9966 132.1393 37.3424 48.3634 27.6498 30.3282 22.8630 30.9715 25.9671 26.2162 17.0638 6.0195 0.4437 1.5940 1.6052
temp: 298.150 k
press: 1.00000 atm
elementType: 8 8 8 8 8 7 6 6 6 6 6 6 6 6 6 6 6 6 6 6 6 6 6 6 6 1 1 1 1 1 1 1 1 1 1 1 1 1 1 1 1 1 1 1
symmnumber: 1
zpe: 896614.2 jmol-1
zpe.correction: 0.341502 hartree
zpe.thermalcorrener: 0.365030 hartree
zpe.thermalcorrenthalpy: 0.365974 hartree
zpe.thermalcorrgfe: 0.287758 hartree
zpe.sumelectzpe: -1164.386102 hartree
zpe.sumelectthermal: -1164.362574 hartree
zpe.sumelectthermalent: -1164.361630 hartree
zpe.sumelectthermalfe: -1164.439846 hartree
dipole: 0.6493 -2.0215 1.0067
dipole: 2.3498
quadrupole: -119.0641 -137.8660 -143.3763
quadrupole: 4.3840 -3.8002 -2.7088
quadrupole: 14.3713 -4.4305 -9.9408 4.3840 -3.8002 -2.7088
hfenergy: -1164.7276042 hartree
pointgroup: C01 [X(C19H19N1O5)]
dipole: 0.2608756 0.8413786 0.2805316 debye
polarizability: 322.9462353|-13.1138346|212.2394277|26.0246942|53.8416238|201.4516978 unknown
InChI: InChI=1S/C19H19NO5/c1-21-16-7-12(8-17(22-2)19(16)23-3)18-13-9-15-14(24-10-25-15)6-11(13)4-5-20-18/h6-9H,4-5,10H2,1-3H3
charge 0 multiplicity 1
44 atoms
O  5.455466 1.016299 1.393528
O  3.552835 2.47429 1.255106
O  -2.505224 0.820051 2.461246
O  -3.955143 -0.136979 -2.17766
O  -4.591274 0.848288 0.460036
N  0.669587 -2.19665 -1.611355
C  3.065575 -1.463603 -0.121078
C  1.914654 -0.614664 -0.170437
C  2.912537 -2.870255 -0.675675
C  0.661769 -1.174912 -0.773198
C  1.9849 -2.823427 -1.909551
C  4.295821 -0.996915 0.40902
C  1.998286 0.741364 0.27533
C  4.341048 0.323155 0.8652
C  3.218582 1.174251 0.787522
C  -0.676339 -0.576887 -0.45784
C  -1.685804 -0.577845 -1.453306
C  -0.974319 -0.054931 0.826472
C  4.924593 2.346449 1.808467
C  -2.26663 0.429429 1.129581
C  -2.966738 -0.075398 -1.166014
C  -3.287009 0.402791 0.138553
C  -3.080416 2.167519 2.667394
C  -4.48535 1.176538 -2.609582
C  -5.600495 -0.241215 0.492448
H  3.893995 -3.304096 -0.938709
H  2.453533 -3.53197 0.088583
H  2.472095 -2.248708 -2.72817
H  1.789132 -3.83953 -2.293607
H  5.17728 -1.642464 0.450585
H  1.14355 1.416207 0.199263
H  -1.472844 -0.9849 -2.444834
H  -0.233053 -0.056682 1.630398
H  5.56222 3.134322 1.378376
H  4.876585 2.380819 2.912849
H  -4.04772 2.266039 2.147689
H  -2.373099 2.94104 2.309619
H  -3.211892 2.258404 3.756461
H  -4.932193 1.722205 -1.759115
H  -5.251045 0.947369 -3.366403
H  -3.677126 1.780811 -3.064034
H  -5.658481 -0.740612 -0.490968
H  -6.55531 0.250314 0.734225
H  -5.338738 -0.972712 1.278681
