program: Gaussian 09
title: 000295314
version: EM64L-G09RevD.01
frameworkgroup: C1[X(C22H18Cl2N2O2)]
method: RPBEPBE
basis: SDD
operation: Freq
keyword: #p
keyword: freq=noraman
keyword: PBEPBE/SDD
title: #p freq=noraman PBEPBE/SDD
converged: YES YES NO NO
title: Mulliken charges:
elementType: Cl Cl O O N N C C C C C C C C C C C C C C C C C C C C C C H H H H H H H H H H H H H H H H H H
charge: -0.071914 -0.073931 -0.264875 -0.258850 -0.486672 -0.490466 0.244336 0.259012 0.364718 0.367206 0.308120 0.302773 -0.458489 0.120747 0.120197 -0.353960 -0.347581 -0.359573 -0.359484 -0.234908 -0.256281 -0.255504 -0.825725 -0.820635 -0.216163 -0.217208 -0.257216 -0.258357 0.252284 0.342713 0.351427 0.219426 0.283653 0.313901 0.313486 0.238813 0.230366 0.269156 0.235789 0.266256 0.238025 0.236564 0.236368 0.234916 0.259410 0.258131
chargesum: 0.00000
title: Mulliken charges with hydrogens summed into heavy atoms:
elementType: Cl Cl O O N N C C C C C C C C C C C C C C C C C C C C C C
charge: -0.071914 -0.073931 -0.264875 -0.258850 -0.143959 -0.139040 0.244336 0.259012 0.364718 0.367206 0.308120 0.302773 -0.206205 0.120747 0.120197 -0.134535 -0.063928 -0.045672 -0.045998 0.003905 -0.256281 -0.255504 -0.090415 -0.079790 0.020205 0.017708 0.002194 -0.000226
polarizability: 4.75953367e+02 -3.39594785e+00 3.29297986e+02 1.05883046e+01 1.01705950e+01 1.24680606e+02
1716.lowfreq: -3.2069 -0.0012 -0.0007 0.0004 1.6370 3.3738 11.2151 14.6451 23.5404
frequency: 11.0713 14.6045 23.5261 36.2801 41.9075 56.7180 67.6280 74.1926 107.6087 116.1294 132.5149 156.6658 174.5175 175.7436 186.9159 195.5791 213.7664 219.4877 229.0596 232.3924 268.4038 287.4254 303.0353 307.0663 318.4839 329.5933 366.9160 368.4851 413.0067 440.4946 447.4370 475.8181 477.4815 498.2959 501.3620 502.6264 535.4753 557.2422 561.1165 565.3167 608.2756 620.8965 641.3674 649.2464 663.5939 673.0160 712.7180 719.6709 720.9443 731.3877 750.5646 786.8058 792.8309 793.5636 794.1853 819.9081 838.0969 848.0601 862.5382 915.5579 916.4559 918.7215 932.7540 937.0393 988.5102 990.1869 991.3794 999.6772 1001.6182 1004.1696 1036.9809 1040.1670 1069.1561 1070.7634 1080.5860 1100.1253 1105.4480 1142.3162 1148.7185 1187.0228 1194.1312 1196.7804 1210.9342 1215.2203 1223.4667 1266.5677 1285.9191 1291.0449 1311.2784 1360.9701 1363.5901 1388.7509 1398.7029 1398.7298 1414.0433 1432.5824 1433.4268 1439.1519 1444.3061 1470.1361 1473.7569 1474.1448 1491.7360 1492.2352 1515.6814 1517.7084 1571.8776 1575.5004 1581.2953 1594.6306 1611.9952 1612.6789 1615.0361 1619.2260 2960.1499 2963.0712 3030.4350 3033.1795 3113.2651 3114.2425 3118.1627 3131.3828 3149.6096 3150.5302 3150.8155 3170.8960 3179.3065 3179.6162 3199.8897 3200.5874 3544.8219 3545.9654
redmass: 7.8386 5.4074 7.2534 5.4379 5.3592 7.8946 7.8215 7.9115 3.8403 3.0870 6.2033 3.4519 1.3738 3.7219 1.1502 5.7054 5.1094 4.7942 6.3926 6.1101 6.3624 4.0031 4.0059 3.8436 4.9489 8.1671 7.7376 7.6530 3.7717 5.7126 5.6967 4.0938 4.1285 5.1717 3.4226 3.8641 6.0849 5.1230 3.9317 3.7344 6.4410 6.8776 1.3478 1.3544 6.8695 4.9164 2.0262 2.5974 2.3536 7.1527 7.3012 5.1231 4.1793 1.5994 1.5046 1.7743 4.5212 3.9855 6.8499 1.3605 1.3633 4.4890 1.6567 1.4232 5.8140 1.3213 1.3184 1.6829 1.7351 1.3757 1.4942 1.4867 2.2983 2.1055 2.9699 2.5320 1.9700 1.7299 1.6620 1.1004 1.5709 1.6382 2.1861 1.8672 2.0431 3.5411 1.9955 2.4296 1.4780 5.6732 5.8972 9.4682 1.2884 1.3012 2.9308 2.4556 2.4065 2.4381 2.7881 1.7962 1.5522 1.3949 1.0442 1.0473 1.9315 2.0938 7.1389 6.8783 4.6471 4.4545 7.0040 5.9961 4.8280 5.2208 1.0414 1.0415 1.0983 1.0983 1.0927 1.0928 1.0889 1.0909 1.0887 1.0888 1.0909 1.0977 1.0956 1.0956 1.0955 1.0955 1.0753 1.0753
irintensity: 0.0548 0.3822 0.1795 0.0590 2.2920 0.3720 10.8469 0.6825 2.9138 0.0703 4.2601 1.3209 1.3673 1.1769 1.1480 2.9711 0.7232 1.7676 3.6368 0.5395 0.3825 0.6609 14.2484 0.6855 5.4471 5.8847 12.9187 6.5293 6.8734 1.2890 2.1333 1.0513 0.4646 1.1905 0.0227 0.3093 10.3322 1.0438 5.3557 0.8273 76.5924 13.9971 56.1290 44.5571 3.4640 12.3299 98.9220 0.4752 2.0252 9.6266 3.2926 1.2123 14.0832 61.1009 76.6526 11.4752 5.1716 30.2217 5.6059 3.3356 3.5264 2.5397 13.1746 4.0537 1.3088 4.1219 4.3761 44.9338 104.3556 1.5584 3.3927 3.5030 20.7970 23.0182 37.1957 11.4132 30.6728 19.0902 2.3747 21.3186 13.0707 3.5104 81.8064 1.9442 172.9883 24.0878 23.4684 109.9119 17.2244 175.2943 36.8697 2.0102 29.0443 12.0947 8.0602 207.2013 78.5758 27.5599 32.2419 219.5083 64.3391 84.7191 15.7965 18.9451 453.3740 112.6944 282.5575 88.6189 146.4564 19.9337 29.5481 25.0174 58.5624 9.1994 25.3177 23.7834 18.5460 16.5021 4.6153 3.5266 16.6813 7.6122 10.1703 8.7922 8.5647 9.9379 4.1235 3.3501 11.0946 11.2884 19.4107 22.7785
temp: 298.150 k
press: 1.00000 atm
elementType: 17 17 8 8 7 7 6 6 6 6 6 6 6 6 6 6 6 6 6 6 6 6 6 6 6 6 6 6 1 1 1 1 1 1 1 1 1 1 1 1 1 1 1 1 1 1
symmnumber: 1
zpe: 909279.0 jmol-1
zpe.correction: 0.346326 hartree
zpe.thermalcorrener: 0.372031 hartree
zpe.thermalcorrenthalpy: 0.372975 hartree
zpe.thermalcorrgfe: 0.286690 hartree
zpe.sumelectzpe: -2027.305295 hartree
zpe.sumelectthermal: -2027.279590 hartree
zpe.sumelectthermalent: -2027.278645 hartree
zpe.sumelectthermalfe: -2027.364931 hartree
dipole: -2.6279 1.9894 -0.7412
dipole: 3.3783
quadrupole: -190.3136 -170.9280 -182.4127
quadrupole: -6.4353 2.3411 -2.4614
quadrupole: -9.0955 10.2901 -1.1946 -6.4353 2.3411 -2.4614
hfenergy: -2027.651621 hartree
pointgroup: C01 [X(C22H18Cl2N2O2)]
dipole: -0.9892226 0.8319669 0.3096099 debye
polarizability: 471.3247237|4.401783|266.5729706|-36.4321189|95.3665128|192.0342651 unknown
InChI: InChI=1S/C22H18Cl2N2O2/c1-13-17(23)8-4-10-19(13)25-21(27)15-6-3-7-16(12-15)22(28)26-20-11-5-9-18(24)14(20)2/h3-12,25-26H,1-2H3
charge 0 multiplicity 1
46 atoms
Cl -8.224392 -0.870123 1.519466
Cl 6.257661 -3.071035 -2.837598
O  -1.475844 -0.988249 -0.749209
O  3.760969 2.113494 1.357752
N  -3.152085 0.055857 0.532981
N  3.331692 0.390774 -0.188718
C  -0.901126 1.028348 0.463161
C  1.459584 1.674846 0.738768
C  -4.289284 -0.759379 0.268009
C  4.634376 -0.127487 -0.435562
C  -5.501471 -0.419057 0.960122
C  4.731722 -1.193241 -1.394861
C  0.479119 0.728203 0.362935
C  -1.859251 -0.052208 0.019853
C  2.948362 1.416576 0.675265
C  -1.299728 2.307863 0.930164
C  1.045456 2.936757 1.239195
C  -4.238858 -1.852174 -0.635819
C  5.783644 0.373649 0.229481
C  -0.324922 3.252666 1.322348
C  -6.627566 -1.226097 0.686906
C  6.025734 -1.706748 -1.630769
C  -5.538452 0.751511 1.925397
C  3.492338 -1.717523 -2.096595
C  -5.399539 -2.617116 -0.864983
C  7.046167 -0.185025 -0.051085
C  -6.610006 -2.314696 -0.206527
C  7.184591 -1.232788 -0.985491
H  0.730511 -0.27699 0.004102
H  -3.296554 0.79705 1.220178
H  2.58393 -0.031236 -0.741559
H  -2.357597 2.597299 0.959964
H  1.817204 3.647338 1.551423
H  -3.297423 -2.084912 -1.134452
H  5.669588 1.187968 0.945808
H  -0.636256 4.238956 1.681453
H  -5.303936 1.708662 1.417393
H  -6.537478 0.861909 2.3718
H  -4.823811 0.616181 2.761791
H  3.748799 -2.526564 -2.795892
H  2.757157 -2.132394 -1.378409
H  2.989022 -0.927004 -2.688058
H  -5.361324 -3.460138 -1.562327
H  7.93312 0.200447 0.462031
H  -7.514345 -2.90427 -0.377154
H  8.160303 -1.671001 -1.210078
