program: Gaussian 09
title: 000022650
version: EM64L-G09RevD.01
frameworkgroup: C1[X(C15H15N3O2)]
method: RPBEPBE
basis: SDD
operation: Freq
keyword: #p
keyword: freq=noraman
keyword: PBEPBE/SDD
title: #p freq=noraman PBEPBE/SDD
converged: YES YES NO NO
title: Mulliken charges:
elementType: O O N N N C C C C C C C C C C C C C C C H H H H H H H H H H H H H H H
charge: -0.443713 -0.257212 -0.147197 -0.104097 -0.133366 0.415038 -0.329816 -0.312781 0.148838 -0.360366 -0.308632 -0.645352 -0.644266 0.179618 0.257519 -0.292871 -0.343964 -0.336213 -0.313307 0.107406 0.242196 0.239952 0.248355 0.274276 0.221494 0.242087 0.242083 0.241708 0.221399 0.241965 0.276600 0.250352 0.267837 0.273370 0.381061
chargesum: 0.00000
title: Mulliken charges with hydrogens summed into heavy atoms:
elementType: O O N N N C C C C C C C C C C C C C C C
charge: -0.062652 -0.257212 -0.147197 -0.104097 -0.133366 0.415038 -0.087620 -0.072829 0.148838 -0.112012 -0.034356 0.060312 0.060807 0.179618 0.257519 -0.016271 -0.093612 -0.068376 -0.039937 0.107406
polarizability: 6.21637452e+02 -2.89270509e+00 1.80501871e+02 -1.96363496e-02 -6.73056802e-03 8.30538189e+01
1716.lowfreq: -7.4063 -0.0008 -0.0002 0.0007 6.9770 7.0876 19.6332 29.3969 47.8288
frequency: 19.6192 29.3585 47.7968 64.0804 72.3584 76.3144 127.2459 139.1082 144.2197 177.5309 180.0498 200.4475 221.2327 259.9327 297.7141 313.0303 348.8027 387.9160 411.4794 432.1656 435.0753 453.8921 484.6578 498.5989 529.1670 539.0906 540.5005 588.9235 603.2450 623.9784 634.5851 687.7782 699.5611 743.2246 743.5873 770.8449 806.8390 822.5923 834.5067 857.4891 882.7630 898.9916 939.5814 965.3212 985.2315 987.7496 993.0372 994.5258 1008.0992 1011.9495 1055.9739 1103.2190 1106.2986 1112.3316 1122.7684 1137.2247 1155.5114 1162.0097 1168.8516 1200.6453 1254.3985 1260.1562 1293.9290 1307.7135 1317.6519 1327.8100 1366.3517 1378.2432 1386.8155 1426.1641 1431.8177 1457.4339 1461.1866 1466.0416 1478.9442 1481.4085 1493.2472 1501.3849 1521.9669 1549.0311 1563.2860 1609.7181 1626.3398 1636.8028 2953.4128 2960.0181 3023.6396 3026.9130 3104.3926 3114.3172 3147.9803 3149.4574 3151.5750 3154.1369 3171.3002 3174.2180 3177.0442 3181.9506 3533.0940
redmass: 4.8437 4.7498 5.9287 5.1326 2.4290 5.9087 2.8218 6.3993 1.7884 3.6197 6.3023 1.1994 4.3081 3.0988 4.3168 5.7034 5.9655 4.6669 2.9970 4.0166 3.3670 5.0450 4.9459 2.7339 4.6698 4.9754 2.2933 1.2623 4.7745 7.1556 7.2187 3.6004 4.8951 3.8820 5.7252 4.5367 1.2595 6.7219 1.7632 1.2596 1.6816 7.4395 3.0649 1.3545 1.3344 2.8472 1.3639 4.2028 1.3483 2.7477 1.5151 1.2366 1.3477 1.3306 1.4282 1.7878 1.7917 1.4656 1.5015 1.6471 2.9719 2.6337 1.4033 1.6645 2.8504 4.3240 3.0831 4.6067 5.7385 4.5932 1.1872 1.2627 2.9062 1.0400 1.0455 2.5687 1.1557 1.3650 1.9738 6.1722 7.7233 6.2854 6.3696 8.3089 1.0366 1.0388 1.0999 1.1026 1.0970 1.0950 1.0884 1.0889 1.0867 1.0890 1.0956 1.0953 1.0952 1.0963 1.0641
irintensity: 0.2343 1.1804 0.8382 0.2824 0.1618 1.1338 2.6029 0.3095 1.3665 0.2370 0.9137 0.0943 2.7343 4.4040 1.5907 8.8101 18.6288 0.6202 0.0003 30.2829 0.1641 2.0062 8.7305 7.6562 2.4617 4.8434 66.1312 60.2235 37.3001 2.6803 2.8342 84.4570 20.7242 7.0520 0.0979 2.8474 1.9855 4.5522 69.4867 4.6634 65.8510 2.1410 47.5533 1.8011 1.3121 2.4921 0.0546 230.0227 0.1124 336.6092 26.0436 0.0086 5.5841 1.0636 25.0395 443.4317 17.6057 74.2616 131.7817 10.7273 22.3715 0.9640 1.3470 215.7335 579.6958 382.8275 179.7161 34.4604 0.5934 16.3507 8.0992 25.5620 0.9529 0.0119 24.5911 6.5902 0.7207 19.5893 202.5063 67.8039 6.4242 454.9168 632.0385 276.8153 84.6400 206.6551 8.0176 64.0703 3.6778 47.4256 3.7382 1.3476 4.3037 3.0402 16.9923 3.4799 25.1374 3.5868 69.3161
temp: 298.150 k
press: 1.00000 atm
elementType: 8 8 7 7 7 6 6 6 6 6 6 6 6 6 6 6 6 6 6 6 1 1 1 1 1 1 1 1 1 1 1 1 1 1 1
symmnumber: 1
zpe: 714540.9 jmol-1
zpe.correction: 0.272154 hartree
zpe.thermalcorrener: 0.290631 hartree
zpe.thermalcorrenthalpy: 0.291575 hartree
zpe.thermalcorrgfe: 0.223515 hartree
zpe.sumelectzpe: -893.841173 hartree
zpe.sumelectthermal: -893.822696 hartree
zpe.sumelectthermalent: -893.821752 hartree
zpe.sumelectthermalfe: -893.889812 hartree
dipole: 8.8731 1.6246 0.0162
dipole: 9.0206
quadrupole: -71.7398 -109.3589 -121.9141
quadrupole: -10.9199 0.0734 -0.0047
quadrupole: 29.2645 -8.3547 -20.9099 -10.9199 0.0734 -0.0047
hfenergy: -894.1133272 hartree
pointgroup: C01 [X(C15H15N3O2)]
dipole: 3.4992146 0.5820204 0.1096586 debye
polarizability: 621.3415712|-9.8496054|179.986064|7.336142|8.1639027|83.8655068 unknown
InChI: InChI=1S/C15H15N3O2/c1-18(2)14-9-7-13(8-10-14)17-16-12-5-3-11(4-6-12)15(19)20/h3-10,19H,1-2H3
charge 0 multiplicity 1
35 atoms
O  -6.794802 1.099176 0.00357
O  -6.70026 -1.21228 -0.196756
N  5.992331 0.0161 0.101128
N  0.348669 -0.5214 -0.030902
N  -0.39283 0.566263 0.050947
C  4.605011 -0.090645 0.069438
C  3.960025 -1.368059 -0.046301
C  3.769946 1.079764 0.152849
C  1.743424 -0.298821 0.007929
C  2.563592 -1.459592 -0.07589
C  2.37807 0.976574 0.122972
C  6.634889 1.333693 0.229651
C  6.827994 -1.191679 0.01781
C  -1.798939 0.314257 0.008981
C  -4.62118 0.065036 -0.053922
C  -2.39966 -0.975215 -0.113517
C  -2.625252 1.4688 0.099007
C  -3.795809 -1.092372 -0.144028
C  -4.025147 1.348633 0.068015
C  -6.091085 -0.117612 -0.091942
H  4.552929 -2.283775 -0.111852
H  4.224322 2.070442 0.241748
H  2.067762 -2.432226 -0.164083
H  1.745507 1.867428 0.187371
H  7.728252 1.206989 0.241771
H  6.339698 1.84284 1.168355
H  6.378126 1.998374 -0.618665
H  6.629394 -1.884509 0.859487
H  7.890264 -0.905856 0.055911
H  6.655988 -1.741667 -0.928524
H  -1.748689 -1.85135 -0.181689
H  -2.138124 2.444644 0.192436
H  -4.28063 -2.069981 -0.237459
H  -4.666692 2.231114 0.136526
H  -7.768395 0.899016 -0.028369
