program: Gaussian 09
title: 000294400
version: EM64L-G09RevD.01
frameworkgroup: C1[X(C15H20O5)]
method: RPBEPBE
basis: SDD
operation: Freq
keyword: #pfreq=noraman
keyword: PBEPBE/SDD
title: #p freq=noraman PBEPBE/SDD
converged: YES YES NO NO
title: Mulliken charges:
elementType: O O O O O C C C C C C C C C C C C C C C H H H H H H H H H H H H H H H H H H H H
charge: -0.274824 -0.256686 -0.406525 -0.234716 -0.217338 -0.082862 0.164697 -0.721257 -0.725054 0.241759 0.122531 -0.482864 0.441016 -0.258102 -0.408620 -0.347656 -0.231997 -0.228070 -0.671362 -0.243706 0.246241 0.242225 0.207594 0.232891 0.211385 0.212118 0.258515 0.238537 0.239134 0.246995 0.227796 0.382212 0.243606 0.249542 0.228942 0.226277 0.219859 0.255191 0.224055 0.228524
chargesum: 0.00000
title: Mulliken charges with hydrogens summed into heavy atoms:
elementType: O O O O O C C C C C C C C C C C C C C C
charge: -0.274824 -0.256686 -0.024313 -0.234716 -0.217338 0.163379 0.164697 -0.038547 -0.043035 0.241759 0.122531 -0.005193 0.441016 0.216689 -0.165015 -0.098115 -0.003054 -0.001793 0.027742 -0.015182
polarizability: 1.96608364e+02 1.64480070e+01 1.54058773e+02 1.44548212e+00 1.34806731e+00 1.62052843e+02
1716.lowfreq: -5.7274 -4.1698 -0.0012 -0.0008 -0.0007 11.6589 25.2255 32.9649 43.8448
frequency: 24.9117 31.9008 43.8240 51.0967 64.9740 65.9755 90.3744 105.2808 119.9695 124.2531 157.5815 172.2982 191.1374 205.9521 217.9039 228.8409 235.2516 258.0105 302.0798 307.9281 323.1992 335.4971 362.1938 400.9751 406.0833 431.2317 440.1369 464.4893 498.2809 509.6319 570.0003 592.8802 615.6005 641.5380 673.5336 700.2150 708.7463 733.8073 749.3167 803.6661 805.6375 812.7940 854.8745 870.3442 896.6230 918.2478 930.4926 942.1398 955.9930 976.8067 977.9478 990.1760 993.2757 998.1862 1012.0211 1025.1678 1026.2152 1057.7908 1086.8787 1095.0238 1129.3128 1149.7802 1157.5956 1171.0730 1187.1284 1190.6284 1195.7470 1208.7704 1243.8634 1276.7819 1281.1037 1307.0744 1316.1074 1334.8990 1345.6873 1355.9867 1383.1129 1384.3071 1391.5107 1401.4885 1439.0651 1457.2142 1458.1178 1464.0242 1468.5904 1475.5408 1482.2498 1483.4167 1485.8842 1492.8591 1593.0982 1607.7777 1613.1137 1656.7468 2981.0408 2992.6536 2993.0100 3015.9411 3022.2011 3037.1453 3070.1831 3082.0766 3082.3064 3087.2494 3097.3839 3102.7045 3106.1531 3121.1294 3124.4564 3128.0488 3139.6844 3149.5754 3163.3121 3505.7521
redmass: 3.9440 3.9002 4.6707 3.5663 3.9437 4.6984 3.0246 4.5205 4.2971 5.2026 3.8551 3.2633 3.1469 1.9529 1.6200 1.4600 1.2473 3.6495 2.5059 2.6262 3.9090 4.7008 4.3144 2.8065 4.0005 3.4174 3.6856 3.6796 2.8105 4.6782 1.7688 3.9755 6.3866 3.0811 3.7977 2.1746 4.8974 3.0822 1.9219 3.2222 3.6454 1.4746 1.2592 4.1632 2.5071 1.5508 1.2843 2.1609 1.9322 1.6390 1.5860 6.0697 1.8916 2.0894 2.7837 3.0828 2.2694 3.0278 1.5568 2.1433 2.9154 2.0734 1.6975 1.0568 1.1340 2.0863 4.1158 2.4542 1.3368 1.1203 1.8117 1.4406 1.2848 1.3896 1.3917 1.2760 1.2776 5.1442 1.2336 1.2070 2.1668 1.1024 1.1025 1.0452 1.0531 1.0455 1.0559 2.1708 1.0533 1.0496 6.1260 9.5790 6.0238 9.4955 1.0374 1.0367 1.0361 1.0586 1.0839 1.0596 1.0983 1.1051 1.0987 1.0974 1.1024 1.0994 1.0994 1.0845 1.1069 1.0877 1.0924 1.0965 1.1016 1.0640
irintensity: 0.0703 0.1608 0.7552 0.1872 1.5857 0.3229 0.1586 0.3809 1.6906 1.7600 4.7257 3.2199 0.3600 1.6666 2.1363 1.5085 0.3635 0.2981 2.9106 12.4204 6.2553 0.3370 4.8358 0.5386 0.2006 6.1701 8.2623 0.3993 9.2879 23.3200 68.8346 15.3178 0.1772 80.3172 27.0564 44.6403 8.7078 10.9211 62.7816 5.6020 6.7503 4.7006 1.6648 11.7469 10.1790 7.0459 1.4526 14.9294 43.5871 7.1310 5.5789 5.1758 87.1601 98.5954 53.7749 74.6923 14.5671 111.5054 3.4975 17.3458 50.4097 25.2750 8.2743 0.1321 3.9916 22.4964 138.9778 16.7513 8.8496 4.8402 13.8644 0.4620 9.9035 5.0886 8.9373 2.1296 14.3181 2.4856 27.6771 23.4489 10.0341 20.6532 7.3351 13.6964 1.3902 1.8913 3.8640 8.2202 16.1001 12.0390 0.6999 114.3470 0.8785 199.5835 28.0859 25.9066 27.5003 21.4357 5.8253 15.3668 25.8192 2.9015 43.7223 28.6461 3.2128 14.9879 25.4304 1.1862 21.6956 1.7251 19.9316 31.6340 18.9040 28.3630
temp: 298.150 k
press: 1.00000 atm
elementType: 8 8 8 8 8 6 6 6 6 6 6 6 6 6 6 6 6 6 6 6 1 1 1 1 1 1 1 1 1 1 1 1 1 1 1 1 1 1 1 1
symmnumber: 1
zpe: 848026.0 jmol-1
zpe.correction: 0.322996 hartree
zpe.thermalcorrener: 0.344419 hartree
zpe.thermalcorrenthalpy: 0.345364 hartree
zpe.thermalcorrgfe: 0.271628 hartree
zpe.sumelectzpe: -958.179813 hartree
zpe.sumelectthermal: -958.158389 hartree
zpe.sumelectthermalent: -958.157445 hartree
zpe.sumelectthermalfe: -958.231181 hartree
dipole: 0.8635 2.6217 0.7190
dipole: 2.8524
quadrupole: -106.0726 -119.2213 -114.9860
quadrupole: 2.1831 2.5230 0.2896
quadrupole: 7.3540 -5.7947 -1.5594 2.1831 2.5230 0.2896
hfenergy: -958.5028086 hartree
pointgroup: C01 [X(C15H20O5)]
dipole: 0.1241868 0.947312 -0.5886597 debye
polarizability: 173.3899043|-26.1428472|177.8229698|5.5301915|-0.8030574|161.507106 unknown
InChI: InChI=1S/C15H20O5/c1-4-19-14(18)15(11(2)3,13(16)17)20-10-12-8-6-5-7-9-12/h5-9,11,16H,4,10H2,1-3H3
charge 0 multiplicity 1
40 atoms
O  -0.152751 -1.583669 -0.175706
O  0.702842 1.204952 -1.009565
O  3.188268 -1.030659 1.324824
O  1.071196 1.110955 1.290243
O  1.467644 -2.45129 1.938023
C  1.884134 -1.35346 -1.405593
C  1.179655 -0.971771 -0.055402
C  3.211407 -0.610797 -1.677997
C  2.071496 -2.885888 -1.502143
C  1.018079 0.555508 0.167368
C  1.910648 -1.570756 1.174594
C  -1.15255 -1.301913 0.897698
C  -2.052943 -0.124945 0.558029
C  0.344205 2.65804 -0.8990
C  -2.284646 0.902949 1.504571
C  -2.707878 -0.06268 -0.699288
C  -3.165957 1.969409 1.208716
C  -3.581374 1.004501 -1.000877
C  1.603113 3.528657 -0.905256
C  -3.81701 2.022675 -0.044977
H  1.147531 -1.037022 -2.16821
H  3.988854 -0.88168 -0.944918
H  3.572377 -0.889307 -2.685126
H  3.081328 0.484797 -1.658569
H  2.852568 -3.240725 -0.802903
H  2.393379 -3.1568 -2.524029
H  1.132501 -3.417611 -1.277106
H  -1.731616 -2.24151 0.937156
H  -0.655233 -1.166627 1.87348
H  -0.246168 2.796579 0.022932
H  -0.289739 2.827118 -1.783253
H  3.608639 -1.410243 2.144158
H  -1.765744 0.874183 2.469946
H  -2.516305 -0.847761 -1.439414
H  -3.340027 2.755234 1.952522
H  -4.082595 1.041755 -1.974932
H  1.313135 4.595842 -0.90433
H  2.216042 3.336975 -0.009002
H  2.211847 3.339137 -1.80639
H  -4.501554 2.846946 -0.275878
