program: Gaussian 09
title: 000294330
version: EM64L-G09RevD.01
frameworkgroup: C1[X(C12H19NO4)]
method: RPBEPBE
basis: SDD
operation: Freq
keyword: #p
keyword: freq=noraman
keyword: PBEPBE/SDD
title: #p freq=noraman PBEPBE/SDD
converged: YES YES NO NO
title: Mulliken charges:
elementType: O O O O N C C C C C C C C C C C C H H H H H H H H H H H H H H H H H H H
charge: -0.267902 -0.246095 -0.301164 -0.300614 -0.088411 -0.458929 -0.444946 -0.386340 -0.370712 -0.175800 0.036811 0.196342 0.198896 -0.256697 -0.254472 -0.671369 -0.669091 0.227582 0.234752 0.228309 0.232574 0.227479 0.307702 0.233169 0.240878 0.265830 0.216123 0.229764 0.220534 0.229866 0.224604 0.209786 0.251850 0.212874 0.225731 0.241084
chargesum: 0.00000
title: Mulliken charges with hydrogens summed into heavy atoms:
elementType: O O O O N C C C C C C C C C C C C
charge: -0.267902 -0.246095 -0.301164 -0.300614 -0.088411 0.003406 0.015938 0.148842 0.103335 0.090030 0.036811 0.196342 0.198896 0.189189 0.195928 0.014871 0.010597
polarizability: 2.16929868e+02 8.67204066e+00 1.63511990e+02 -5.25355243e+00 4.38945643e+00 1.06475939e+02
1716.lowfreq: -9.9977 -5.6594 -3.0932 -0.0005 -0.0002 0.0002 28.8464 34.8562 46.4269
frequency: 28.5157 34.6437 46.4251 52.9422 69.0648 71.7235 82.3217 97.8142 140.7499 150.3648 167.2047 206.3460 218.9816 229.6938 237.9111 259.0866 284.9030 311.1495 320.8484 331.3530 403.3986 434.8212 442.7165 508.4697 568.6585 600.3930 634.3710 685.5777 707.4016 741.1312 760.9124 778.4681 811.7642 816.9100 833.5569 856.1132 865.1056 869.5642 914.6690 923.5973 955.0446 977.5282 996.6385 1017.1066 1035.7605 1062.7248 1094.4970 1095.2522 1108.7575 1121.3846 1145.7317 1154.2272 1156.2910 1172.4001 1176.7191 1224.3835 1230.9391 1253.3153 1278.7508 1279.3202 1305.3631 1314.8762 1325.6205 1340.0168 1350.1146 1358.2656 1385.4012 1386.3567 1391.6184 1416.4086 1451.9204 1453.6545 1461.1657 1462.9045 1468.3014 1472.8109 1484.3856 1485.4203 1485.9858 1495.4523 1567.8253 1574.2668 1638.4148 2975.2796 2977.8365 2988.9058 2989.8714 3013.5457 3014.2584 3024.3379 3024.8458 3057.0619 3058.5347 3082.6558 3083.8211 3084.0251 3087.4747 3089.7581 3095.7514 3105.5148 3113.8278 3115.9038
redmass: 3.1404 3.4685 3.1395 3.1779 3.2850 4.1908 3.5403 3.8458 3.8958 3.4840 3.9039 1.7358 1.4691 2.1216 1.8916 2.1536 4.5177 3.1204 3.2350 3.5125 4.3081 3.4843 4.9551 4.6389 1.8792 5.1720 5.0088 5.0595 6.7774 3.0555 3.6599 2.1071 1.4025 1.5313 2.7333 2.2784 1.9071 3.1982 2.1632 1.5292 1.4426 1.9440 2.6221 2.9966 5.0670 1.9847 2.1429 2.1195 1.6248 3.7658 2.8116 1.6934 1.7862 1.6585 1.4853 1.3142 1.7117 2.0630 1.1194 1.1156 1.3453 1.2371 1.3754 1.4504 1.3346 1.3400 1.2419 1.2383 2.4980 2.0373 1.1181 1.1192 1.0449 1.0444 1.0894 1.0876 1.0797 1.0651 1.0519 1.0982 8.4186 7.7524 7.4916 1.0641 1.0662 1.0358 1.0361 1.0658 1.0620 1.0589 1.0588 1.0979 1.0986 1.1006 1.0979 1.0975 1.1033 1.1032 1.1054 1.0889 1.1059 1.1049
irintensity: 0.8109 1.6823 0.4094 3.3740 0.2432 0.9515 0.8068 1.0805 0.4803 3.2032 2.7962 0.4214 3.9004 0.6723 1.4642 1.0094 7.0593 8.3473 14.1157 18.4712 5.5598 4.7591 2.5382 1.3808 2.2340 0.0721 1.1706 14.4020 7.5304 3.0959 30.6433 7.0951 0.1653 1.3197 1.8476 9.4418 3.8478 4.6291 8.3418 3.2707 21.2712 3.7977 9.4892 44.6236 284.4637 21.9266 7.1011 39.5210 111.4839 200.5368 172.0621 31.4804 100.0638 94.8271 79.0768 45.4559 113.7343 156.4999 4.9052 5.9983 6.9807 3.4126 30.0942 26.5730 7.5291 18.3228 23.4118 26.2343 77.3768 22.3805 32.5954 29.2253 13.4421 11.0934 11.2827 36.5660 5.5237 11.1513 15.2797 18.2396 311.2325 237.3058 542.6735 70.3480 10.0272 27.3494 26.0908 30.5185 27.1240 29.0367 45.3832 13.3236 21.6523 28.0914 38.4499 40.6890 1.5758 4.5911 53.7752 1.5924 37.3337 36.1319
temp: 298.150 k
press: 1.00000 atm
elementType: 8 8 8 8 7 6 6 6 6 6 6 6 6 6 6 6 6 1 1 1 1 1 1 1 1 1 1 1 1 1 1 1 1 1 1 1
symmnumber: 1
zpe: 784129.3 jmol-1
zpe.correction: 0.298659 hartree
zpe.thermalcorrener: 0.317310 hartree
zpe.thermalcorrenthalpy: 0.318255 hartree
zpe.thermalcorrgfe: 0.249722 hartree
zpe.sumelectzpe: -822.990423 hartree
zpe.sumelectthermal: -822.971772 hartree
zpe.sumelectthermalent: -822.970828 hartree
zpe.sumelectthermalfe: -823.039361 hartree
dipole: -3.4691 0.5024 -0.2740
dipole: 3.5160
quadrupole: -76.4415 -95.9910 -106.9765
quadrupole: 8.3575 2.7490 -5.4851
quadrupole: 16.6949 -2.8547 -13.8402 8.3575 2.7490 -5.4851
hfenergy: -823.2890825 hartree
pointgroup: C01 [X(C12H19N1O4)]
dipole: 1.3756307 -0.1067758 -0.0988705 debye
polarizability: 215.5069605|11.6163398|165.0560117|7.3006504|-0.8495496|106.354825 unknown
InChI: InChI=1S/C12H19NO4/c1-3-16-11(14)10(12(15)17-4-2)9-13-7-5-6-8-13/h9H,3-8H2,1-2H3
charge 0 multiplicity 1
36 atoms
O  -2.77849 0.014849 -0.10644
O  -1.044501 -2.082319 -0.651504
O  -1.810099 1.974209 -0.923472
O  0.390151 -1.763549 1.156669
N  2.030205 0.859124 0.040338
C  4.246362 -0.034843 0.2461
C  4.322451 1.394468 -0.35119
C  2.762707 -0.439737 0.073243
C  2.976893 2.01408 0.077941
C  0.695837 1.051633 -0.105223
C  -0.382688 0.157954 -0.142038
C  -1.676871 0.804624 -0.456733
C  -0.294418 -1.275437 0.209001
C  -4.118588 0.611666 -0.370268
C  -1.139655 -3.526286 -0.292631
C  -4.559534 1.504017 0.795086
C  0.005025 -4.32155 -0.929543
H  4.508853 -0.012028 1.319619
H  4.926536 -0.74437 -0.25327
H  4.385492 1.348505 -1.453685
H  5.185288 1.971037 0.021582
H  2.58555 -0.972137 -0.882973
H  2.377863 -1.08045 0.884297
H  3.03872 2.42138 1.106985
H  2.626466 2.817311 -0.593394
H  0.408928 2.099163 -0.273095
H  -4.774741 -0.26627 -0.487937
H  -4.073564 1.184483 -1.313385
H  -2.121819 -3.829694 -0.690512
H  -1.126699 -3.6213 0.807497
H  -4.537844 0.945171 1.746925
H  -5.592866 1.861159 0.625653
H  -3.898127 2.382161 0.879317
H  -0.136754 -5.402395 -0.741132
H  0.032255 -4.162188 -2.02165
H  0.974276 -4.019741 -0.497977
