program: Gaussian 09
title: 000294343
version: EM64L-G09RevD.01
frameworkgroup: C1[X(C13H17BrN2O2)]
method: RPBEPBE
basis: SDD
operation: Freq
keyword: #p
keyword: freq=noraman
keyword: PBEPBE/SDD
title: #p freq=noraman PBEPBE/SDD
converged: YES YES NO NO
title: Mulliken charges:
elementType: Br O O N N C C C C C C C C C C C C C H H H H H H H H H H H H H H H H H
charge: -0.017532 -0.287132 -0.478810 -0.067923 0.002743 0.175613 0.069985 -0.374558 0.152755 -0.398942 -0.708512 -0.717032 0.527103 -0.690673 -0.330219 -0.310366 -0.327288 -0.345326 0.228499 0.234013 0.226877 0.226248 0.206962 0.243578 0.231006 0.227604 0.240326 0.206145 0.233516 0.233423 0.217308 0.365875 0.301721 0.257737 0.245276
chargesum: 0.00000
title: Mulliken charges with hydrogens summed into heavy atoms:
elementType: Br O O N N C C C C C C C C C C C C C
charge: -0.017532 -0.287132 -0.112936 -0.067923 0.002743 0.175613 0.069985 0.087955 0.152755 0.054183 -0.026965 -0.042957 0.527103 -0.006426 -0.330219 -0.008645 -0.069551 -0.100051
polarizability: 1.80329073e+02 -6.90513512e+00 1.73028437e+02 -2.23023776e+01 9.86912473e+00 1.58362036e+02
1716.lowfreq: -11.2467 -8.1364 -0.0009 -0.0005 -0.0004 6.3157 23.8854 31.3409 53.3882
frequency: 22.8308 31.3263 53.3128 62.7034 84.0982 98.6157 122.3219 139.5654 173.9479 204.5831 206.5855 223.1727 247.1683 252.7569 269.1949 275.9136 291.2524 317.2287 332.9328 349.2978 357.4423 390.3264 428.6835 434.0509 452.9448 502.0578 532.1247 583.6219 598.4259 651.2415 675.1688 700.7818 742.7407 776.0840 783.9766 805.6394 849.4405 853.3404 866.3166 916.5291 917.7868 920.3062 925.0324 947.3970 956.0070 969.8687 984.2555 989.5360 1012.7503 1060.6416 1070.7977 1087.7596 1100.9103 1143.3501 1151.1551 1158.0152 1170.7690 1192.0775 1234.1461 1246.1979 1249.3149 1272.5633 1302.1613 1316.1839 1319.9737 1363.7504 1376.0902 1387.2378 1389.9467 1393.8497 1442.9909 1452.2854 1465.7680 1468.7316 1470.4297 1474.6832 1474.9544 1486.6319 1486.9486 1517.6441 1567.6551 1635.8262 2982.8899 2985.9155 2988.8857 3006.6627 3021.5780 3064.9413 3078.5115 3083.3491 3084.3005 3092.2222 3093.7969 3100.6724 3101.1899 3144.4301 3150.9206 3196.1014 3546.3469
redmass: 3.5033 5.7167 5.1569 3.2373 4.2305 3.4060 4.2423 5.9083 2.4917 1.0871 1.6279 2.1656 2.5411 1.6647 3.9554 4.1288 3.3759 3.4332 2.2764 2.5539 3.8424 1.2523 3.0589 3.2704 4.4391 4.6384 4.2310 4.4997 4.4099 5.7754 8.1767 6.9033 4.1943 1.4148 5.1773 5.1761 1.9743 3.6320 1.8542 1.4933 6.2992 1.6931 2.9094 1.2842 2.5822 1.9826 6.3743 1.5236 1.3669 3.3345 2.3584 2.4029 1.6629 1.3095 2.1361 2.7374 2.2117 1.8285 2.1216 2.5769 1.7441 1.5394 7.2092 1.3700 1.4761 1.6286 1.2106 1.3198 1.5549 1.2020 2.0253 1.0492 1.0495 1.0877 1.0601 1.0723 1.0520 1.0583 1.0600 8.0647 6.6114 11.7547 1.0354 1.0361 1.0354 1.0635 1.0584 1.0975 1.1003 1.0996 1.0997 1.1046 1.1005 1.1006 1.1042 1.0896 1.0937 1.0940 1.0655
irintensity: 0.3907 0.0785 0.3709 0.2812 0.5494 0.8585 1.4041 0.0321 2.2284 0.0423 0.8273 0.0638 0.2404 0.1843 2.6521 3.0849 0.3047 4.8877 3.7085 13.5271 29.2165 161.6123 1.2884 1.4995 11.1470 6.6407 1.3655 24.4888 5.0916 23.0111 0.1016 28.2494 5.0101 3.3048 9.3542 8.1773 45.2673 6.6851 53.7951 4.9824 85.5806 0.4678 35.1393 2.6477 28.2381 3.8965 45.3221 0.2346 0.6728 6.7563 13.2892 21.4725 3.6370 7.6479 52.2792 18.6490 36.4366 15.7930 9.2564 10.2872 20.5546 23.1208 0.9867 18.4696 3.7167 36.2300 22.7474 33.9926 26.9412 11.5792 13.2906 3.9321 2.9743 9.4970 8.6669 13.4627 8.0307 8.4094 15.6876 5.3913 16.1635 75.2692 20.2442 22.8017 29.6867 19.1568 44.1816 1.2283 11.8129 47.5869 37.6414 1.4205 24.7596 29.7271 27.2130 24.1173 2.4471 3.6403 15.7154
temp: 298.150 k
press: 1.00000 atm
elementType: 35 8 8 7 7 6 6 6 6 6 6 6 6 6 6 6 6 6 1 1 1 1 1 1 1 1 1 1 1 1 1 1 1 1 1
symmnumber: 1
zpe: 729344.3 jmol-1
zpe.correction: 0.277793 hartree
zpe.thermalcorrener: 0.296562 hartree
zpe.thermalcorrenthalpy: 0.297506 hartree
zpe.thermalcorrgfe: 0.229642 hartree
zpe.sumelectzpe: -777.602652 hartree
zpe.sumelectthermal: -777.583882 hartree
zpe.sumelectthermalent: -777.582938 hartree
zpe.sumelectthermalfe: -777.650802 hartree
dipole: 4.6439 1.5354 -1.6551
dipole: 5.1636
quadrupole: -109.9450 -113.5859 -118.4686
quadrupole: -2.6201 5.1290 2.0504
quadrupole: 4.0548 0.4139 -4.4687 -2.6201 5.1290 2.0504
hfenergy: -777.8804442 hartree
pointgroup: C01 [X(C13H17Br1N2O2)]
dipole: 1.8024746 -0.9268955 0.1377104 debye
polarizability: 182.6514602|-5.6851311|160.9473585|22.3960445|10.5571781|168.1207269 unknown
InChI: InChI=1S/C13H17BrN2O2/c1-4-13(17,9-5-6-15-7-10(9)14)11-16-12(2,3)8-18-11/h5-7,17H,4,8H2,1-3H3
charge 0 multiplicity 1
35 atoms
Br -0.876536 1.344638 2.208627
O  2.155497 -1.5339 0.172135
O  -0.269403 -2.15005 -1.19623
N  1.480106 0.652949 -0.299275
N  -3.449552 1.685047 -1.071696
C  2.994468 0.720297 -0.236307
C  -0.265386 -1.198151 -0.049421
C  3.4355 -0.779738 -0.039975
C  1.12278 -0.566984 -0.051116
C  -0.522921 -2.012485 1.257586
C  3.388969 1.600976 0.970402
C  3.520983 1.312677 -1.558873
C  -1.353951 -0.158311 -0.354435
C  -1.912677 -2.677808 1.288403
C  -1.721343 0.929993 0.477688
C  -2.089424 -0.281924 -1.562628
C  -2.754282 1.816764 0.091421
C  -3.107133 0.638801 -1.879465
H  3.923996 -1.203305 -0.934666
H  4.06082 -0.94025 0.852925
H  -0.395271 -1.355605 2.134902
H  0.274104 -2.777839 1.31986
H  4.488023 1.708541 1.029492
H  2.941794 2.604256 0.867463
H  3.025024 1.161176 1.916272
H  3.19817 0.703107 -2.42133
H  3.12871 2.334446 -1.698114
H  4.62599 1.359466 -1.552017
H  -2.720485 -1.929068 1.369653
H  -2.086352 -3.270479 0.373008
H  -1.991113 -3.354075 2.158362
H  0.509656 -2.7516 -1.066993
H  -1.842319 -1.103208 -2.237259
H  -3.029309 2.658202 0.735528
H  -3.675134 0.547448 -2.811227
