program: Gaussian 09
title: 000294334
version: EM64L-G09RevD.01
frameworkgroup: C1[X(C14H23NO4)]
method: RPBEPBE
basis: SDD
operation: Freq
keyword: #p
keyword: freq=noraman
keyword: PBEPBE/SDD
title: #p freq=noraman PBEPBE/SDD
converged: YES YES NO NO
title: Mulliken charges:
elementType: O O O O N C C C C C C C C C C C C C C H H H H H H H H H H H H H H H H H H H H H H H
charge: -0.246942 -0.271031 -0.296977 -0.302249 -0.045477 -0.367381 -0.388216 -0.383085 -0.397118 -0.474560 -0.425568 -0.178731 0.050360 0.188752 0.200160 -0.256152 -0.257623 -0.669639 -0.669944 0.206326 0.183784 0.204358 0.218597 0.221044 0.211414 0.211485 0.220898 0.205231 0.316906 0.219363 0.235543 0.269593 0.221084 0.231547 0.216182 0.230343 0.224188 0.243988 0.213717 0.225310 0.250743 0.209775
chargesum: 0.00000
title: Mulliken charges with hydrogens summed into heavy atoms:
elementType: O O O O N C C C C C C C C C C C C C C
charge: -0.246942 -0.271031 -0.296977 -0.302249 -0.045477 0.022729 0.034739 0.049373 0.035266 0.047578 0.029338 0.090862 0.050360 0.188752 0.200160 0.196479 0.188902 0.012254 0.015885
polarizability: 2.31169561e+02 -7.30130777e+00 1.83075498e+02 1.25959509e+01 1.67513213e+00 1.32620452e+02
1716.lowfreq: -11.3945 -0.0010 0.0006 0.0009 4.5074 6.4521 24.2646 28.4225 38.7961
frequency: 23.4103 27.2321 38.7786 46.9160 65.2636 69.1930 69.8551 84.2551 97.9292 140.1166 144.2374 150.6053 192.6217 217.5689 224.5495 259.8751 278.0017 284.9973 312.4867 322.7206 331.7968 357.3784 360.4641 397.8897 433.7377 440.4660 479.3440 511.8166 525.6586 578.2974 631.8659 672.9698 710.1910 734.5618 743.0334 749.3316 762.9558 781.8655 810.4858 816.9507 831.4587 852.1277 865.4874 873.9407 904.4782 962.5415 971.7784 976.7026 999.0180 1014.7512 1017.5564 1033.0633 1056.0686 1094.3906 1094.9002 1096.3092 1108.6904 1136.1734 1153.0266 1154.3330 1158.9092 1180.1789 1206.8997 1222.8432 1240.9412 1255.1317 1274.6918 1278.0384 1278.7441 1298.6936 1328.5365 1336.8877 1345.5912 1350.7055 1352.6398 1356.0895 1363.2093 1371.6276 1385.0975 1386.0920 1400.4212 1435.8372 1451.5074 1452.9408 1457.7400 1460.6793 1461.7092 1464.3774 1468.5420 1475.5148 1481.1310 1485.2417 1485.9044 1495.8025 1568.9927 1582.2908 1639.9550 2964.1697 2974.5841 2976.1877 2983.1284 2988.6634 2989.7500 2991.7140 3006.2988 3022.5571 3025.0427 3026.2136 3028.5623 3037.0636 3044.1099 3070.0821 3075.1124 3083.9534 3084.4563 3087.7757 3089.0596 3091.6421 3113.9877 3115.4195
redmass: 3.7010 3.4381 3.1270 3.1626 3.9392 3.6587 3.3378 5.1255 3.6134 2.6873 3.1364 2.8527 5.6203 1.1881 1.3636 2.6426 2.7783 2.8987 2.5075 2.7401 3.3463 3.1081 3.9572 3.5681 3.1086 5.4909 2.8301 1.9541 3.4740 3.0530 4.6443 5.2709 6.5383 1.6928 2.3801 2.2626 3.5218 2.4287 1.4350 1.5548 3.2249 2.7832 2.0837 2.1181 1.9429 1.9449 1.8536 1.7157 2.6202 2.2427 2.0736 4.4703 2.2902 2.1516 2.1446 2.2436 2.6023 2.4642 1.8577 1.7060 2.9302 1.3602 1.4127 2.0009 1.2824 1.8018 1.1364 1.1201 1.1205 1.5137 1.2514 1.3721 1.3927 1.3355 1.3220 1.3048 1.3756 1.2879 1.2383 1.2359 2.2041 1.5906 1.1207 1.1196 1.0890 1.0458 1.0445 1.0808 1.0893 1.0864 1.0875 1.0520 1.0514 1.1896 7.7147 5.8085 6.3208 1.0631 1.0605 1.0608 1.0635 1.0357 1.0361 1.0656 1.0615 1.1003 1.0586 1.0588 1.0957 1.1006 1.1021 1.1027 1.1029 1.0976 1.0979 1.1030 1.1034 1.0884 1.1063 1.1053
irintensity: 0.4600 1.4430 0.3598 1.4885 2.5630 0.4315 0.2957 0.9902 1.2152 1.1247 1.5986 2.4100 1.5306 3.7116 1.6392 0.6450 1.3715 2.5243 12.1417 1.6998 15.8388 3.6600 7.6213 1.8932 3.5932 0.1409 3.9034 5.0807 0.0795 7.3732 2.3379 15.0371 11.2985 4.0119 6.4607 2.1084 30.0282 1.6881 1.0696 1.0727 2.0058 2.9563 22.1396 1.8157 24.9734 21.8514 11.7353 6.1167 7.1489 7.4976 46.7107 252.2360 61.6133 16.1087 83.9049 55.7959 216.3668 134.4503 76.2320 25.0716 45.4149 72.5107 59.7016 185.7871 4.9482 128.9005 4.0665 4.6469 11.9682 31.5319 1.9117 1.5458 1.8096 19.5005 0.8201 18.2855 1.6379 9.5621 25.4462 20.4766 84.9032 22.7647 28.7934 29.6801 13.8779 12.4152 14.3944 10.9857 21.2231 16.2971 12.0148 10.4347 14.1224 49.2543 411.6487 114.5762 515.5648 37.5325 28.0256 6.8951 35.8660 24.9218 28.1367 35.8211 72.0148 23.8646 32.6314 41.8695 48.5692 37.7401 93.4039 40.4781 9.7896 43.4076 39.4215 1.9084 4.7930 1.6294 35.3135 35.6892
temp: 298.150 k
press: 1.00000 atm
elementType: 8 8 8 8 7 6 6 6 6 6 6 6 6 6 6 6 6 6 6 1 1 1 1 1 1 1 1 1 1 1 1 1 1 1 1 1 1 1 1 1 1 1
symmnumber: 1
zpe: 934212.5 jmol-1
zpe.correction: 0.355823 hartree
zpe.thermalcorrener: 0.376627 hartree
zpe.thermalcorrenthalpy: 0.377571 hartree
zpe.thermalcorrgfe: 0.304006 hartree
zpe.sumelectzpe: -901.429101 hartree
zpe.sumelectthermal: -901.408297 hartree
zpe.sumelectthermalent: -901.407353 hartree
zpe.sumelectthermalfe: -901.480918 hartree
dipole: 3.1681 0.6400 -0.5785
dipole: 3.2834
quadrupole: -92.9612 -109.8293 -119.2991
quadrupole: -6.6275 2.9999 -6.5886
quadrupole: 14.4020 -2.4661 -11.9359 -6.6275 2.9999 -6.5886
hfenergy: -901.7849238 hartree
pointgroup: C01 [X(C14H23N1O4)]
dipole: -1.1739727 -0.3393951 -0.4187456 debye
polarizability: 232.4196451|6.5041382|176.5721454|-9.0639574|16.109616|137.8737211 unknown
InChI: InChI=1S/C14H23NO4/c1-3-18-13(16)12(14(17)19-4-2)11-15-9-7-5-6-8-10-15/h11H,3-10H2,1-2H3
charge 0 multiplicity 1
42 atoms
O  1.79405 -1.176238 -0.981944
O  2.988414 0.917727 0.393276
O  0.788902 -2.134793 0.884962
O  1.403426 2.624274 0.527634
N  -1.791268 0.103066 1.133147
C  -3.758411 -0.741859 -1.04877
C  -3.421192 0.767207 -1.204275
C  -2.561219 -1.602296 -0.569011
C  -3.532329 1.634346 0.079803
C  -2.100949 -1.328219 0.882595
C  -2.977211 0.970627 1.371752
C  -0.590266 0.717181 0.944007
C  0.679098 0.290346 0.533073
C  1.074345 -1.099857 0.214156
C  1.672259 1.388783 0.464521
C  2.352621 -2.513752 -1.335585
C  4.054083 1.957491 0.325175
C  1.345137 -3.320082 -2.161963
C  4.476437 2.399044 1.730322
H  -4.083462 -1.131604 -2.033252
H  -4.62432 -0.875533 -0.366388
H  -4.086788 1.216048 -1.966922
H  -2.393255 0.849566 -1.609405
H  -1.707872 -1.44573 -1.258605
H  -2.824338 -2.677466 -0.629566
H  -4.593127 1.89333 0.269956
H  -3.002155 2.589357 -0.101321
H  -2.912052 -1.606314 1.582702
H  -1.215841 -1.93591 1.129182
H  -3.753032 0.33133 1.828176
H  -2.716873 1.748152 2.113654
H  -0.626641 1.802141 1.122371
H  3.260095 -2.272822 -1.912947
H  2.620464 -3.04455 -0.405203
H  4.874662 1.454397 -0.212356
H  3.678953 2.812853 -0.263923
H  1.026578 -2.752478 -3.05373
H  0.456695 -3.567386 -1.556522
H  1.807755 -4.265954 -2.500979
H  4.789627 1.531529 2.336877
H  3.644486 2.911638 2.241212
H  5.328619 3.101411 1.66301
