program: Gaussian 09
title: 000294386
version: EM64L-G09RevD.01
frameworkgroup: C1[X(C17H14Cl2N2O5S)]
method: RPBEPBE
basis: SDD
operation: Freq
keyword: #p
keyword: freq=noraman
keyword: PBEPBE/SDD
title: #p freq=noraman PBEPBE/SDD
converged: YES YES NO NO
title: Mulliken charges:
elementType: Cl Cl S O O O O O N N C C C C C C C C C C C C C C C C C H H H H H H H H H H H H H H
charge: -0.001493 0.005687 0.983247 -0.408885 -0.412652 -0.567416 -0.506099 -0.503434 -0.421050 -0.384849 0.484584 0.243261 0.554602 -0.684005 -0.468562 -0.047006 0.170858 -0.311847 -0.436600 -0.177362 -0.403411 0.416468 -0.400828 -0.393970 -0.057900 -0.199753 -0.105398 0.240890 0.289925 0.188276 0.250394 0.250625 0.304498 0.290058 0.322945 0.301427 0.247618 0.263451 0.359582 0.343561 0.380563
chargesum: 0.00000
title: Mulliken charges with hydrogens summed into heavy atoms:
elementType: Cl Cl S O O O O O N N C C C C C C C C C C C C C C C C C
charge: -0.001493 0.005687 0.983247 -0.049303 -0.069091 -0.186853 -0.506099 -0.503434 -0.130993 -0.061904 0.484584 0.243261 0.554602 -0.443115 -0.178638 -0.047006 0.170858 -0.123571 -0.185975 0.073032 -0.098913 0.416468 -0.099401 -0.146351 -0.057900 0.063699 -0.105398
polarizability: 4.77384835e+02 2.88101967e+00 2.45747837e+02 -2.56737176e+01 5.01904994e+00 1.52309881e+02
1716.lowfreq: -11.1228 -3.7750 -3.2440 -0.0021 -0.0010 0.0011 6.6067 11.0586 17.5997
frequency: 4.9833 10.8858 17.4728 24.7528 37.2983 58.4460 67.8706 89.8357 100.7941 106.4316 130.1527 148.0795 161.3649 173.9722 182.8936 193.1144 206.0848 220.8124 240.2206 246.6156 256.1666 284.6742 289.7699 290.4216 292.4991 307.1979 317.5571 326.7543 340.0025 385.5627 409.7398 416.0460 419.7858 440.5094 445.2664 453.4584 491.6012 500.5564 508.6646 522.9625 530.8465 572.9322 581.7118 588.9465 592.2482 603.0735 620.8658 649.7657 661.8544 692.7490 713.1682 732.9306 761.2328 765.1150 814.3246 818.6399 823.7703 845.0536 854.4402 864.4283 872.6281 913.5676 919.0063 930.5447 944.0725 953.5019 959.2399 967.6383 1004.9282 1046.7341 1052.8275 1065.6326 1079.2125 1114.8481 1133.0686 1146.2819 1148.1875 1173.9048 1183.0166 1211.0829 1231.8833 1246.2053 1256.5085 1266.4369 1278.3370 1325.8350 1339.4364 1351.1686 1372.7489 1377.5970 1383.2113 1426.0479 1437.0009 1442.1565 1454.9947 1456.4178 1504.7255 1536.7039 1568.8441 1594.9441 1596.8210 1604.3006 1638.8253 2966.5971 3096.7554 3121.7936 3131.3771 3159.0566 3163.9918 3170.3385 3173.2467 3185.0931 3461.6049 3479.8904 3485.8004 3543.0434 3592.3850
redmass: 9.9875 10.3947 9.6273 8.1423 7.1486 8.6561 7.0828 5.2655 5.4227 6.6552 4.4447 6.7177 2.5737 4.7352 3.3271 10.2798 4.9412 5.6196 4.6855 1.6916 3.8191 5.0816 3.1956 2.4782 6.5533 1.5883 4.7134 8.0936 7.5776 6.6213 3.9835 6.2969 2.8395 3.4548 2.7209 4.1279 5.6388 7.4143 3.5455 4.6014 9.7883 1.6065 4.5388 5.0070 3.3730 6.2516 6.6850 2.6232 6.7075 4.3933 4.9107 4.7279 5.1102 2.5343 1.4443 1.7727 7.7655 1.4342 7.7004 1.5818 2.9665 1.8118 2.0735 2.6599 3.6238 1.3523 1.3476 13.3933 4.8818 3.6689 1.1963 3.9692 2.4178 1.9792 1.3308 1.5830 1.5906 1.9510 2.0702 1.7664 1.3362 1.3539 1.7158 1.5686 1.6127 3.5536 2.0238 2.1046 2.3945 4.5206 2.3799 4.6361 2.2322 1.6628 3.1015 2.7547 2.2216 2.7521 8.3101 6.7776 7.1617 6.4386 6.2328 1.0835 1.0885 1.0914 1.0896 1.0925 1.0935 1.0943 1.0928 1.0929 1.0764 1.0661 1.0775 1.0651 1.0657
irintensity: 0.4977 0.9011 0.4023 0.4735 1.3282 0.3245 0.6487 2.2757 2.8257 1.3962 11.3163 1.2995 33.2912 8.8883 15.5905 2.0656 4.7000 6.1955 22.4940 66.7840 34.0369 6.8216 15.2361 134.0458 8.4854 198.5198 53.4625 39.4659 5.9632 4.4356 121.7899 32.7480 50.7468 19.6851 24.1809 13.0572 9.2027 13.3936 61.3237 12.3479 133.6084 73.4272 19.9615 3.2316 33.2446 41.0243 24.0796 2.9126 17.7123 5.3855 12.2326 8.6788 3.3872 1.9223 37.3421 23.8711 87.6713 2.3070 30.6842 10.0638 0.7617 54.1603 41.9152 86.4641 47.8787 1.2178 1.9064 79.4944 31.9968 8.2198 70.1804 25.1739 80.2928 35.6190 223.0222 17.1057 1.6103 24.8481 21.2509 4.4081 39.3817 6.9267 30.1404 47.6274 28.2068 107.3227 9.8583 6.5784 51.5517 23.0840 16.7245 8.5286 12.4890 5.6382 154.3590 49.6624 133.1333 60.1436 12.9976 5.4542 40.1578 43.2495 357.3836 27.0340 20.1520 11.5302 11.3833 5.1150 9.1669 1.4354 5.9602 17.6255 44.7946 43.9351 9.7709 11.0042 28.9228
temp: 298.150 k
press: 1.00000 atm
elementType: 17 17 16 8 8 8 8 8 7 7 6 6 6 6 6 6 6 6 6 6 6 6 6 6 6 6 6 1 1 1 1 1 1 1 1 1 1 1 1 1 1
symmnumber: 1
zpe: 738403.5 jmol-1
zpe.correction: 0.281243 hartree
zpe.thermalcorrener: 0.308079 hartree
zpe.thermalcorrenthalpy: 0.309023 hartree
zpe.thermalcorrgfe: 0.219122 hartree
zpe.sumelectzpe: -2457.860768 hartree
zpe.sumelectthermal: -2457.833932 hartree
zpe.sumelectthermalent: -2457.832988 hartree
zpe.sumelectthermalfe: -2457.922889 hartree
dipole: 6.3389 -1.6282 -4.2296
dipole: 7.7924
quadrupole: -246.1719 -163.3652 -188.8374
quadrupole: -8.9196 8.9094 0.9270
quadrupole: -46.7137 36.0929 10.6208 -8.9196 8.9094 0.9270
hfenergy: -2458.1420108 hartree
pointgroup: C01[X(C17H14Cl2N2O5S1)]
dipole: -2.4778694 -0.4979001 -1.7352799 debye
polarizability: 475.3086079|29.0247504|215.1806993|21.1656922|-43.9447776|184.9532456 unknown
InChI: InChI=1S/C17H14Cl2N2O5S/c18-14-4-1-9(7-15(14)19)17(23)21-20-11-2-3-13-10(5-11)6-12(8-16(13)22)27(24,25)26/h1-8,17,20-24H
charge 0 multiplicity 1
41 atoms
Cl -7.599735 -1.124151 1.971508
Cl -8.963841 -0.205881 -0.879005
S  6.695965 1.357461 0.099921
O  4.007105 -2.968354 1.045161
O  -2.554729 0.376416 1.549901
O  7.250298 0.784686 -1.581763
O  6.395449 2.945734 0.031488
O  7.735881 0.768575 1.191133
N  -0.912414 0.903491 -1.067502
N  -2.179165 0.353291 -0.83908
C  2.705712 0.349328 -0.261835
C  2.693698 -1.034209 0.177785
C  0.267457 0.272437 -0.635352
C  1.485811 0.973701 -0.658079
C  3.945345 1.070037 -0.291128
C  5.088352 0.400077 0.117076
C  3.932953 -1.646233 0.594621
C  1.438553 -1.724184 0.179934
C  0.257824 -1.100478 -0.213953
C  -2.99432 0.900312 0.253135
C  5.139683 -0.939451 0.564512
C  -4.475857 0.614327 -0.031203
C  -5.266916 -0.03229 0.942704
C  -5.074535 1.02564 -1.249815
C  -6.629655 -0.289147 0.692807
C  -6.439066 0.771434 -1.497751
C  -7.218286 0.106617 -0.527234
H  1.513454 2.02248 -0.979059
H  3.986242 2.116019 -0.609657
H  1.375411 -2.777764 0.484534
H  -2.833756 1.992918 0.371194
H  -0.689814 -1.646158 -0.229909
H  6.069494 -1.406632 0.896776
H  -0.855166 1.895239 -1.322534
H  -2.677114 0.041201 -1.678649
H  -4.818783 -0.311098 1.900099
H  -4.492367 1.566675 -2.005063
H  -6.907058 1.087032 -2.4346
H  3.117471 -3.396857 1.088138
H  -2.319749 -0.579603 1.422161
H  8.190768 1.10616 -1.706312
