program: Gaussian 09
title: 000294347
version: EM64L-G09RevD.01
frameworkgroup: C1[X(C18H13NO5)]
method: RPBEPBE
basis: SDD
operation: Freq
keyword: #p
keyword: freq=noraman
keyword: PBEPBE/SDD
title: #p freq=noraman PBEPBE/SDD
converged: YES YES NO NO
title: Mulliken charges:
elementType: O O O O O N C C C C C C C C C C C C C C C C C C H H H H H H H H H H H H H
charge: -0.266355 -0.261500 -0.262374 -0.249602 -0.239907 -0.009635 -0.239580 -0.566330 0.514530 0.134349 -0.506799 0.358083 0.205210 -0.423428 0.160935 -0.335520 0.192821 -0.445494 0.173072 -0.355759 -0.325924 -0.204103 -0.240254 -0.203387 0.297235 0.259221 0.268041 0.271759 0.270042 0.253594 0.264854 0.283311 0.260577 0.235500 0.241003 0.246289 0.245528
chargesum: 0.00000
title: Mulliken charges with hydrogens summed into heavy atoms:
elementType: O O O O O N C C C C C C C C C C C C C C C C C C
charge: -0.266355 -0.261500 -0.262374 -0.249602 -0.239907 -0.009635 0.057656 -0.039068 0.514530 0.134349 -0.235040 0.358083 0.205210 -0.153386 0.160935 -0.081927 0.192821 -0.180640 0.173072 -0.072448 -0.065347 0.272400 -0.240254 0.288430
polarizability: 2.66514194e+02 1.20069620e+01 1.85053014e+02 2.38151619e+00 -2.74008082e+00 2.01686037e+02
1716.lowfreq: -8.8016 -4.5959 -0.0012 -0.0008 -0.0007 1.7915 12.1712 15.4525 20.1886
frequency: 12.0001 15.1794 20.0360 29.2559 61.4415 69.0230 73.3150 92.9160 109.5456 122.5887 156.0517 179.1273 215.6383 218.2368 262.9021 274.8176 297.1470 312.8013 360.5984 379.1031 391.2747 413.4364 427.2900 434.7900 450.2592 500.1303 550.8206 563.4326 565.1293 599.0709 624.4601 632.4223 648.4084 676.9934 682.8667 721.9468 727.6513 733.2999 758.7330 781.0767 783.7234 824.5827 833.1212 836.0647 837.7988 866.2537 877.9995 884.5482 892.0712 940.5589 945.0901 963.6737 973.6172 974.2942 981.8106 1003.7441 1050.5809 1061.6418 1064.0101 1067.2195 1070.2724 1120.8537 1124.6821 1129.9386 1139.1174 1166.5718 1187.5776 1205.7401 1232.6615 1241.9411 1260.5438 1265.6204 1267.4543 1302.9191 1332.4491 1363.5694 1364.1526 1385.9731 1402.7244 1431.2958 1442.9487 1449.1717 1474.7677 1476.4081 1486.5159 1487.1600 1565.7901 1600.8207 1612.1260 1625.9083 1629.3990 2190.6287 2982.5792 3003.0012 3004.3658 3023.2647 3056.9545 3105.2656 3105.7738 3159.6423 3163.3267 3163.7413 3182.7430 3184.4427 3187.8055
redmass: 4.6830 3.1708 4.6477 5.4660 6.8414 5.0266 3.5033 7.0600 9.8040 6.7227 6.6286 3.9405 6.2595 5.9598 5.9176 8.0363 7.2306 7.7758 7.2403 7.2121 5.4051 2.9727 4.2947 3.6183 5.9636 3.5732 6.5582 5.7332 6.9765 5.0983 4.4427 4.6259 6.7973 9.2706 9.7487 4.1776 4.3189 6.0602 6.0126 6.2230 6.0482 1.4430 6.6354 2.3604 2.3511 1.6087 1.6852 3.9653 3.2442 3.0323 1.3825 3.8322 6.6788 1.5934 3.0867 2.8777 3.1380 3.7534 1.4567 3.7379 1.4862 1.0370 1.1108 1.4570 1.3026 1.4043 1.3303 1.7148 1.5103 2.6742 1.9784 2.5747 1.3376 1.7117 1.8873 1.3629 1.2712 4.2649 3.5915 1.1803 3.9764 4.0183 2.0558 1.8342 1.3684 1.5295 8.8639 7.7222 7.7550 8.5448 8.3177 12.5553 1.0634 1.0816 1.0593 1.0536 1.0967 1.1192 1.1122 1.0899 1.0929 1.0894 1.0927 1.0964 1.0965
irintensity: 2.8264 6.2223 4.6726 0.1919 0.1618 9.2859 9.1245 7.5716 2.9896 2.9340 2.0782 6.4662 0.6825 0.1800 5.5084 1.2653 0.1064 2.7423 1.3858 14.8112 4.0147 3.8894 8.1016 4.2916 2.9728 0.1480 5.7823 5.2568 13.5105 3.8511 1.8992 36.0219 14.1179 0.1507 0.9300 7.1931 3.3377 2.6214 6.2476 16.2076 10.0452 51.3316 35.0270 20.4875 53.9834 31.3218 11.1627 8.0886 1.6667 41.9688 6.5480 43.0389 191.3929 18.8651 72.9307 0.6949 3.4712 23.5568 4.4752 69.1400 5.9637 0.0425 1.4854 16.2075 6.6220 8.9562 8.9884 8.9846 26.4949 153.2165 202.9478 436.4574 21.6307 29.6518 92.6775 11.6840 2.0251 10.2891 12.2358 17.1458 49.9950 83.4500 128.0084 65.7351 44.8392 53.7960 205.7533 11.7096 4.9459 21.7130 0.0789 19.9022 21.3732 18.0611 126.8279 111.8350 9.0123 24.0465 30.0598 0.9464 0.5448 0.2282 1.7713 3.0423 4.2078
temp: 298.150 k
press: 1.00000 atm
elementType: 8 8 8 8 8 7 6 6 6 6 6 6 6 6 6 6 6 6 6 6 6 6 6 6 1 1 1 1 1 1 1 1 1 1 1 1 1
symmnumber: 1
zpe: 706803.0 jmol-1
zpe.correction: 0.269207 hartree
zpe.thermalcorrener: 0.289793 hartree
zpe.thermalcorrenthalpy: 0.290737 hartree
zpe.thermalcorrgfe: 0.214931 hartree
zpe.sumelectzpe: -1122.831801 hartree
zpe.sumelectthermal: -1122.811215 hartree
zpe.sumelectthermalent: -1122.810271 hartree
zpe.sumelectthermalfe: -1122.886077 hartree
dipole: -4.1414 -4.3539 -0.0235
dipole: 6.0090
quadrupole: -113.6471 -149.1669 -140.9765
quadrupole: -9.8363 9.0886 10.3813
quadrupole: 20.9497 -14.5700 -6.3797 -9.8363 9.0886 10.3813
hfenergy: -1123.1010083 hartree
pointgroup: C01 [X(C18H13N1O5)]
dipole: 1.7546839 1.575669 -0.1658585 debye
polarizability: 267.82335|5.6829568|185.5136139|2.0558942|6.4098433|199.9162814 unknown
InChI: InChI=1S/C18H13NO5/c19-8-13(11-1-3-15-17(6-11)23-9-21-15)5-14(20)12-2-4-16-18(7-12)24-10-22-16/h1-4,6-7,13H,5,9-10H2
charge 0 multiplicity 1
37 atoms
O  -4.203185 1.542697 -2.25566
O  -4.594839 2.846781 -0.278645
O  4.843695 0.127268 -1.611781
O  5.946371 1.084546 0.296081
O  0.24158 -1.120247 2.289787
N  -2.400531 -3.909386 -1.312593
C  -1.497416 -1.952176 0.262545
C  0.004385 -1.673853 -0.071108
C  -2.359648 -0.682027 0.160236
C  0.758489 -1.081962 1.131332
C  -2.877291 -0.265549 -1.102489
C  2.118538 -0.505207 0.912002
C  -3.61232 0.918926 -1.127434
C  -2.593764 0.090212 1.324093
C  -3.842825 1.686292 0.034906
C  -3.343287 1.298055 1.279021
C  4.023774 0.029402 -0.461432
C  2.75007 -0.523668 -0.374169
C  4.678388 0.593831 0.657901
C  2.789714 0.062869 2.031882
C  4.082464 0.625893 1.924228
C  -4.983232 2.68356 -1.705831
C  -2.004037 -3.032822 -0.606347
C  6.097681 0.784243 -1.159056
H  -1.528706 -2.310079 1.31061
H  0.072204 -1.003488 -0.946338
H  0.512328 -2.619267 -0.351739
H  -2.727545 -0.858357 -2.009789
H  -2.174741 -0.245891 2.277371
H  -3.521527 1.893801 2.177401
H  2.27137 -0.954265 -1.256406
H  2.26904 0.050167 2.994135
H  4.595492 1.064343 2.783255
H  -6.061305 2.442673 -1.760378
H  -4.716497 3.598694 -2.256907
H  6.227933 1.73309 -1.705321
H  6.941875 0.0866 -1.291163
