program: Gaussian 09
title: 000022629
version: EM64L-G09RevD.01
frameworkgroup: C1[X(C13H18O3)]
method: RPBEPBE
basis: SDD
operation: Freq
keyword: #pfreq=noraman
keyword: PBEPBE/SDD
title: #p freq=noraman PBEPBE/SDD
converged: YES YES NO NO
title: Mulliken charges:
elementType: O O O C C C C C C C C C C C C C H H H H H H H H H H H H H H H H H H
charge: -0.301286 -0.221553 -0.385069 -0.362239 -0.349390 -0.393882 -0.354586 -0.269344 -0.694617 0.201544 0.106540 0.189848 -0.299494 -0.396689 -0.249517 -0.194556 0.191028 0.191005 0.189452 0.188963 0.209760 0.208557 0.195562 0.195720 0.225469 0.224544 0.216476 0.210082 0.209934 0.279396 0.219061 0.232998 0.231562 0.354720
chargesum: 0.00000
title: Mulliken charges with hydrogens summed into heavy atoms:
elementType: O O O C C C C C C C C C C C C C
charge: -0.301286 -0.221553 -0.030349 0.019794 0.029025 0.024436 0.036696 0.180670 -0.058126 0.201544 0.106540 0.189848 -0.020097 -0.177628 -0.016519 0.037006
polarizability: 2.17329356e+02 5.94425720e+00 1.59469517e+02 2.23973702e+00 -9.23390582e-01 8.78339919e+01
1716.lowfreq: -7.5685 -0.0007 -0.0005 0.0004 3.0131 5.7095 16.5630 29.5550 35.2566
frequency: 13.7409 29.5259 35.1677 47.7617 72.0944 97.1422 112.2389 124.4183 133.2583 174.2217 178.2738 211.6886 236.0523 250.3762 291.7959 347.1045 382.4686 404.0643 426.7144 437.0505 446.7484 521.3988 525.1670 552.5611 649.6216 672.8167 724.9964 746.3349 756.1977 767.0354 771.8891 793.7563 821.8571 851.2358 882.5282 888.5679 919.8397 956.6836 986.2672 989.6424 1011.6344 1019.0441 1042.2882 1050.8097 1071.1261 1084.4171 1099.1465 1126.6576 1151.2426 1159.8365 1174.4765 1196.5490 1221.5367 1238.1744 1244.1892 1252.8511 1271.9057 1290.6446 1291.8781 1292.8445 1296.3152 1340.3103 1357.3140 1373.8889 1390.7983 1395.8201 1428.9765 1464.3489 1466.1860 1470.7649 1477.6917 1478.5054 1485.4055 1489.5434 1490.3000 1593.2908 1607.8441 1631.4027 2954.1013 2958.9476 2968.9214 2972.3264 2986.7797 2990.7318 2996.9801 3007.4303 3029.2685 3042.3955 3068.3587 3070.8624 3071.6175 3111.3345 3142.9874 3163.3013 3187.2130 3545.8506
redmass: 4.5863 4.2668 3.5159 2.1497 3.5649 2.0140 3.9685 2.7336 2.0988 3.5366 5.1326 4.4579 1.1141 4.4836 5.1386 4.4471 8.0328 1.1951 3.2422 3.0988 3.5467 4.0695 3.6216 7.7004 6.7050 4.3117 1.0665 1.0957 2.2356 1.8982 7.4545 1.1575 7.4163 1.4906 1.1991 1.9702 6.4369 1.3586 1.1535 1.3251 3.8086 7.1438 2.2117 3.1833 2.6403 2.0987 2.0611 2.7807 1.4876 1.2250 1.0622 1.5045 3.2408 1.3345 1.2838 2.8989 1.1114 1.0828 1.1124 1.3454 1.4263 1.4228 1.6270 1.5691 1.2176 6.8496 2.3585 1.0741 1.0730 1.0761 1.0740 1.0424 1.0826 1.9703 1.2456 6.7925 6.6626 10.5272 1.0589 1.0590 1.0589 1.0366 1.0597 1.0979 1.0567 1.1015 1.1036 1.1046 1.1020 1.1063 1.0993 1.0889 1.0895 1.0957 1.0963 1.0657
irintensity: 1.0664 0.2164 0.8943 1.0841 0.1108 2.5253 1.2221 0.3797 0.0530 3.1359 1.5498 1.4914 0.0185 0.5715 5.5280 3.7978 8.5437 118.2153 7.5559 5.1793 8.1660 7.7818 14.0311 7.2113 7.2318 21.5128 12.1754 0.2200 60.4481 32.5847 1.7240 2.2237 47.1877 0.1080 1.1689 5.3179 0.7806 1.6283 0.0870 0.2988 0.1181 350.4887 6.1709 75.5306 16.2370 10.0583 134.5068 1.1420 1.5568 45.0805 12.8178 0.0555 340.8058 40.3629 0.0344 10.7460 0.1546 0.1999 0.7924 12.1219 49.8779 0.2984 0.5528 0.6874 11.3593 14.2734 27.9121 0.0036 0.1558 2.3406 0.1210 12.5070 5.1927 39.7324 7.5861 29.2485 30.5384 239.3057 0.0518 9.5173 86.0948 35.3322 18.1219 0.2604 47.8404 0.6836 27.1318 23.1319 23.5021 147.4268 54.8135 13.3808 10.8178 18.0627 7.0598 27.5137
temp: 298.150 k
press: 1.00000 atm
elementType: 8 8 8 6 6 6 6 6 6 6 6 6 6 6 6 6 1 1 1 1 1 1 1 1 1 1 1 1 1 1 1 1 1 1
symmnumber: 1
zpe: 741862.2 jmol-1
zpe.correction: 0.282560 hartree
zpe.thermalcorrener: 0.299834 hartree
zpe.thermalcorrenthalpy: 0.300779 hartree
zpe.thermalcorrgfe: 0.234280 hartree
zpe.sumelectzpe: -730.630040 hartree
zpe.sumelectthermal: -730.612766 hartree
zpe.sumelectthermalent: -730.611821 hartree
zpe.sumelectthermalfe: -730.678320 hartree
dipole: 1.2752 2.2073 0.1288
dipole: 2.5524
quadrupole: -65.2231 -98.6571 -98.0785
quadrupole: 3.0542 1.2122 -0.8931
quadrupole: 22.0965 -11.3375 -10.7590 3.0542 1.2122 -0.8931
hfenergy: -730.9126 hartree
pointgroup: C01 [X(C13H18O3)]
dipole: 0.5171752 -0.8588677 -0.0574742 debye
polarizability: 217.5075953|-4.8783962|159.2812472|-2.7357582|-0.5404994|87.8440224 unknown
InChI: InChI=1S/C13H18O3/c1-2-3-4-7-10-16-13(15)11-8-5-6-9-12(11)14/h5-6,8-9,14H,2-4,7,10H2,1H3
charge 0 multiplicity 1
34 atoms
O  -0.043712 0.088996 -0.02129
O  1.048465 2.142908 0.068563
O  3.791781 2.007019 -0.158168
C  -3.850711 0.466121 0.016047
C  -5.008213 -0.553476 -0.075061
C  -2.456415 -0.201025 -0.045146
C  -6.405195 0.104504 -0.005874
C  -1.332638 0.832701 0.03315
C  -7.557582 -0.918785 -0.099351
C  1.116882 0.89326 0.008959
C  2.345854 0.048572 -0.033237
C  3.65404 0.619103 -0.106008
C  2.237089 -1.370072 0.007572
C  4.797735 -0.221262 -0.132098
C  3.370923 -2.202901 -0.017052
C  4.659323 -1.621138 -0.08668
H  -3.9454 1.042217 0.960146
H  -3.947065 1.202283 -0.809155
H  -4.919987 -1.126004 -1.02199
H  -4.91195 -1.294097 0.746214
H  -2.355776 -0.776999 -0.985414
H  -2.34836 -0.921943 0.788376
H  -6.492406 0.67538 0.941149
H  -6.499606 0.846167 -0.825238
H  -1.363824 1.548408 -0.809718
H  -1.36485 1.414883 0.973525
H  -8.544589 -0.423579 -0.046745
H  -7.512093 -1.481612 -1.050907
H  -7.503409 -1.653054 0.726621
H  1.233414 -1.798359 0.060488
H  5.797133 0.230583 -0.18876
H  3.255617 -3.29057 0.017699
H  5.553167 -2.254162 -0.106272
H  4.750658 2.253933 -0.211346
