program: Gaussian 09
title: 000294323
version: EM64L-G09RevD.01
frameworkgroup: C1[X(C12H17ClN2O2)]
method: RPBEPBE
basis: SDD
operation: Freq
keyword: #p
keyword: freq=noraman
keyword: PBEPBE/SDD
title: #p freq=noraman PBEPBE/SDD
converged: YES YES NO NO
title: Mulliken charges:
elementType: Cl O O N N C C C C C C C C C C C C H H H H H H H H H H H H H H H H H
charge: -0.092208 -0.472888 -0.322946 -0.403378 -0.386255 -0.067015 -0.260198 0.458162 -0.718201 -0.387651 -0.411984 0.321392 -0.235647 -0.218157 -0.349204 -0.248725 -0.543863 0.268729 0.212949 0.199074 0.210637 0.256582 0.294916 0.225146 0.278843 0.352948 0.225930 0.226809 0.295749 0.265187 0.241681 0.228773 0.261284 0.293529
chargesum: 0.00000
title: Mulliken charges with hydrogens summed into heavy atoms:
elementType: Cl O O N N C C C C C C C C C C C C
charge: -0.092208 -0.119940 -0.322946 -0.108462 -0.090505 0.201714 -0.047249 0.458162 -0.051908 -0.162505 -0.133140 0.321392 -0.009717 0.008652 0.157664 -0.019952 0.010950
polarizability: 1.64155071e+02 2.91172871e+01 1.37592961e+02 -2.34847785e+00 -1.76916740e-01 1.48789433e+02
1716.lowfreq: -11.4053 -10.0252 -7.6379 -0.0024 -0.0013 -0.0010 6.5264 8.9762 20.4965
frequency: 2.2252 6.5327 20.0571 36.4344 68.1191 72.2790 88.6720 108.7903 157.7759 192.0959 215.4214 225.4790 234.6836 270.4117 271.7310 275.9730 341.9882 379.9927 397.7967 402.1888 434.3742 453.4841 490.5339 522.0481 583.4058 585.2657 604.8182 616.2004 645.5572 704.1687 710.9695 718.0623 748.7513 815.6801 837.6327 855.7241 859.2195 912.9205 927.8721 948.6333 967.9882 979.4018 983.8846 990.3479 999.2909 1026.2269 1041.9387 1064.1726 1088.8555 1099.2297 1126.4321 1146.3316 1158.9750 1171.9606 1187.2360 1187.4477 1210.6700 1220.5822 1241.6358 1261.9805 1297.3871 1305.4792 1320.1527 1337.7418 1367.5731 1374.0609 1383.2936 1387.3160 1429.9098 1436.8394 1438.4553 1456.3740 1471.4352 1482.9369 1484.4919 1504.5716 1594.1985 1616.6798 1625.0877 2956.7281 2972.5834 3004.4682 3037.8772 3056.9823 3065.1636 3068.5350 3096.1458 3115.2651 3127.9683 3142.5371 3151.1031 3158.4449 3173.7672 3525.6985 3542.5955 3584.8994
redmass: 8.3948 4.7623 4.3440 6.7833 7.2626 5.1066 3.5337 3.6112 4.0525 4.6064 1.5644 4.0592 1.8160 3.4418 2.1850 1.4607 2.6506 1.8341 3.3572 2.9980 2.7316 2.4965 3.2357 3.0280 2.0318 3.4987 2.0709 6.3916 5.0263 2.0975 10.2826 2.7069 1.9103 3.0206 2.3195 1.2590 2.3968 1.9069 1.5167 2.6357 2.4455 1.4106 2.2092 5.7970 1.3229 2.1904 1.9551 1.8247 1.8314 2.7863 2.2093 1.3674 1.5771 1.0535 1.3049 1.5984 1.4857 1.4893 1.3926 1.5326 1.2314 1.3111 1.2908 1.3304 1.3107 1.7611 1.4252 3.2696 1.1322 2.1519 1.1109 1.3024 1.2010 1.1229 2.0892 2.3239 6.2419 6.1107 5.0805 1.0841 1.0379 1.0592 1.0860 1.0648 1.0976 1.0947 1.0980 1.0871 1.0873 1.0928 1.1121 1.0977 1.0970 1.0768 1.0768 1.0661
irintensity: 0.1453 0.0458 0.0018 0.4264 16.0045 10.2460 2.9462 0.5563 6.0557 9.1918 4.3889 1.2427 23.2391 19.5601 47.3285 89.2143 19.7905 5.4205 7.2922 0.9552 11.7575 5.2945 6.0854 0.3644 119.8369 15.9666 226.1998 0.0574 26.5645 33.8271 17.9409 39.8416 37.6472 7.2497 10.7489 1.0305 8.0185 10.1234 4.5762 51.0112 22.0680 0.0992 6.9349 0.0161 0.7059 7.8645 2.2662 25.8235 19.4611 9.5488 11.8680 68.4711 8.4026 0.4897 5.6073 3.6868 5.1331 25.9107 93.3106 87.5653 17.1329 27.0395 6.9305 18.4407 1.4907 13.3290 17.3516 1.3067 36.3697 14.3613 10.0459 42.7831 2.0199 8.1231 15.6087 522.4781 0.7225 5.8718 135.2981 40.0665 40.9570 42.1446 4.1604 15.9579 41.2649 11.5266 18.0892 7.6716 3.3365 26.2205 15.0856 24.3906 6.8709 20.2037 18.9116 6.8713
temp: 298.150 k
press: 1.00000 atm
elementType: 17 8 8 7 7 6 6 6 6 6 6 6 6 6 6 6 6 1 1 1 1 1 1 1 1 1 1 1 1 1 1 1 1 1
symmnumber: 1
zpe: 723700.7 jmol-1
zpe.correction: 0.275643 hartree
zpe.thermalcorrener: 0.293863 hartree
zpe.thermalcorrenthalpy: 0.294807 hartree
zpe.thermalcorrgfe: 0.222794 hartree
zpe.sumelectzpe: -1186.212534 hartree
zpe.sumelectthermal: -1186.194314 hartree
zpe.sumelectthermalent: -1186.193370 hartree
zpe.sumelectthermalfe: -1186.265382 hartree
dipole: -1.8120 -0.7032 -0.8840
dipole: 2.1353
quadrupole: -95.7175 -111.2498 -107.7961
quadrupole: 3.5684 5.7617 9.3926
quadrupole: 9.2036 -6.3286 -2.8749 3.5684 5.7617 9.3926
hfenergy: -1186.4881766 hartree
pointgroup: C01 [X(C12H17Cl1N2O2)]
dipole: 0.5138927 -0.595838 0.2943141 debye
polarizability: 135.272633|-27.6833542|166.0770257|-4.2971407|2.8982272|149.1878059 unknown
InChI: InChI=1S/C12H17ClN2O2/c1-9(15-12(17)14-8-7-13)11(16)10-5-3-2-4-6-10/h2-6,9,11,14-16H,7-8H2,1H3
charge 0 multiplicity 1
34 atoms
Cl -3.581141 1.840293 1.369176
O  2.233015 -1.329963 1.815927
O  -1.264804 -1.416565 -1.723698
N  -0.19238 -1.836115 0.317819
N  -2.378592 -0.970189 0.289108
C  1.12682 -2.065394 -0.282109
C  2.156023 -1.076494 0.360416
C  1.747763 0.377407 0.15749
C  1.571577 -3.538492 -0.143471
C  1.796192 0.936562 -1.143932
C  1.27602 1.169453 1.231478
C  -1.270944 -1.40281 -0.450181
C  1.372127 2.263948 -1.370473
C  0.845316 2.496856 1.004658
C  -3.521693 -0.363938 -0.391266
C  0.889622 3.048263 -0.296191
C  -3.468167 1.166979 -0.409713
H  1.020316 -1.820877 -1.354284
H  3.147274 -1.263522 -0.106901
H  1.57305 -3.867892 0.913288
H  2.584432 -3.692102 -0.562757
H  0.86985 -4.190649 -0.689311
H  -0.211654 -1.760898 1.337865
H  2.158461 0.335713 -1.987665
H  1.26714 0.742863 2.238331
H  2.71931 -2.178469 1.964983
H  1.415833 2.683969 -2.381577
H  0.477065 3.099405 1.842397
H  -2.286967 -0.790457 1.29094
H  -3.494194 -0.718393 -1.439025
H  -4.466237 -0.703914 0.070964
H  0.557454 4.07784 -0.471142
H  -4.32546 1.61141 -0.937645
H  -2.512129 1.545574 -0.799397
