program: Gaussian 09
title: 000294318
version: EM64L-G09RevD.01
frameworkgroup: C1[X(C8H9Cl3F4O2)]
method: RPBEPBE
basis: SDD
operation: Freq
keyword: #p
keyword: freq=noraman
keyword: PBEPBE/SDD
title: #p freq=noraman PBEPBE/SDD
converged: YES YES NO NO
title: Mulliken charges:
elementType: Cl Cl Cl F F F F O O C C C C C C C C H H H H H H H H H
charge: 0.081668 0.043659 -0.056169 -0.095032 -0.123160 -0.139929 -0.084478 -0.401757 -0.232346 0.235368 -0.600551 -0.028839 0.054205 0.297311 -0.513681 -0.310841 -0.596495 0.279022 0.286074 0.248075 0.258299 0.254421 0.239907 0.387708 0.256716 0.260846
chargesum: 0.00000
title: Mulliken charges with hydrogens summed into heavy atoms:
elementType: Cl Cl Cl F F F F O O C C C C C C C C
charge: 0.081668 0.043659 -0.056169 -0.095032 -0.123160 -0.139929 -0.084478 -0.014050 -0.232346 0.235368 -0.035455 -0.028839 0.054205 0.297311 -0.007307 0.183487 -0.078933
polarizability: 1.47107627e+02 1.27225764e+00 1.11677329e+02 4.42022805e+00 -1.23122973e+01 1.06141504e+02
1716.lowfreq: -13.6892 -4.9872 -0.0020 -0.0007 0.0007 4.7671 15.4795 34.8986 39.3626
frequency: 15.2571 34.8490 39.2791 44.2135 69.3844 72.0949 88.6726 119.7754 130.8517 146.8195 186.2666 199.5932 222.3891 244.2839 267.6940 274.6931 295.4623 297.8707 330.0164 342.2117 372.7429 379.1079 390.4771 398.3329 451.3493 469.5327 530.1234 561.9121 621.0106 656.3067 687.5883 693.4773 737.9799 768.7982 812.9181 843.0102 866.9613 882.9964 956.3171 989.0476 1000.0631 1019.9881 1030.8179 1042.7462 1070.7888 1080.9428 1098.7624 1117.1783 1131.7353 1141.0682 1239.2476 1246.0831 1263.7160 1286.9328 1307.8095 1332.5112 1369.0097 1417.9577 1423.3686 1434.4638 1457.5533 1475.3479 1611.0826 2954.1732 2995.6350 2998.4003 3025.5421 3044.9022 3084.6022 3090.9416 3126.9120 3137.0459
redmass: 15.0079 7.6625 2.4167 15.4300 3.6867 11.2577 9.7004 13.0353 2.3698 11.7418 11.7503 10.8982 5.9947 7.3148 15.2656 7.5489 6.8805 9.7344 8.6265 8.7729 22.0303 18.9327 9.9048 4.9263 2.3541 8.2936 9.1086 9.9137 5.0449 3.5934 5.1706 1.2221 1.6298 2.6935 1.8299 6.8328 2.8094 3.4430 6.7983 3.5561 3.9797 3.8454 5.9330 2.2829 2.6013 4.4675 1.9183 3.4178 5.1770 2.1185 1.3312 1.2493 1.2760 1.0954 1.3021 1.5788 1.7676 1.2709 1.1033 1.1492 1.0938 1.0880 6.0769 1.0609 1.0695 1.0918 1.0612 1.0564 1.1036 1.0949 1.1109 1.0690
irintensity: 0.8009 0.6614 2.6229 1.1234 2.3787 1.0016 0.0439 1.4023 0.4741 0.5509 0.8748 2.6609 0.4083 3.1081 0.4745 4.1290 2.1745 0.3097 26.3522 7.9810 0.8555 1.5728 4.1550 11.3419 6.4985 17.1728 24.1801 10.0178 41.2590 52.6116 23.8960 38.0825 28.4317 117.2459 20.3279 84.6033 48.3921 45.2684 243.9993 8.2317 49.5985 30.4981 68.8848 21.5669 10.2620 60.4482 18.7594 310.1880 49.2348 10.2387 15.7768 20.4863 3.8885 3.1881 21.6140 122.2278 28.5945 138.8671 6.8669 66.1568 2.3471 13.3404 44.9516 21.5503 7.4446 4.5575 1.6843 25.4129 3.7421 1.3372 22.4781 463.8966
temp: 298.150 k
press: 1.00000 atm
elementType: 17 17 17 9 9 9 9 8 8 6 6 6 6 6 6 6 6 1 1 1 1 1 1 1 1 1
symmnumber: 1
zpe: 433939.4 jmol-1
zpe.correction: 0.165279 hartree
zpe.thermalcorrener: 0.184272 hartree
zpe.thermalcorrenthalpy: 0.185216 hartree
zpe.thermalcorrgfe: 0.114567 hartree
zpe.sumelectzpe: -2238.895889 hartree
zpe.sumelectthermal: -2238.876897 hartree
zpe.sumelectthermalent: -2238.875952 hartree
zpe.sumelectthermalfe: -2238.946601 hartree
dipole: 2.0659 -0.6597 -4.2506
dipole: 4.7719
quadrupole: -147.4061 -119.3312 -121.4667
quadrupole: 2.5614 -5.0858 0.9390
quadrupole: -18.0048 10.0701 7.9346 2.5614 -5.0858 0.9390
hfenergy: -2239.0611682 hartree
pointgroup: C01 [X(C8H9Cl3F4O2)]
dipole: -0.8643772 0.5999565 -1.554855 debye
dipolederiv: -0.2197047 -0.1212731 -0.0172222 -0.1061976 -0.6605205 -0.1353521 -0.0185118 -0.0942886 -0.1126678 -0.1421224 0.0246942 0.0138327 0.071135 -0.3063456 -0.2628676 0.0780037 -0.2265359 -0.6172046 -0.6546178 -0.0155655 0.0720301 0.0094852 -0.1747411 -0.0075785 0.1850156 0.0015749 -0.2207093 -0.7287664 0.2792926 -0.1260383 0.1683421 -0.5111849 0.0666102 -0.0595355 0.1017595 -0.2584121 -0.3760975 -0.0594306 0.0474681 -0.0418251 -0.3330295 -0.0392338 -0.0409131 -0.1306471 -0.7574686 -0.8064254 -0.031843 0.2254286 -0.1469391 -0.4582679 0.0513855 0.2031207 0.0227367 -0.3756429 -0.4874292 0.1307338 -0.2339367 0.2662281 -0.4583214 0.1545644 -0.2537352 0.1110051 -0.4942653 -0.5995224 0.0286254 0.0667487 0.1021799 -0.5736267 -0.1001939 0.1329077 -0.0836837 -0.6917727 -0.8155321 0.023125 -0.0212711 0.016916 -0.3013523 -0.0933014 -0.1725038 -0.0752242 -0.7836863 0.2416124 0.0616308 -0.0445191 -0.1998507 0.2357719 0.2142358 0.0146613 -0.094022 0.2998173 -0.5755367 -0.0382765 0.0628172 -0.1043165 -0.0773353 0.0834567 0.0697104 0.0387549 -0.1303112 1.2343345 -0.073053 0.1170401 0.0938215 1.5322677 0.1272101 0.0896462 0.1321182 1.1067364 1.2519651 -0.1881408 -0.019835 -0.1117847 1.1353585 -0.0626423 -0.0597234 0.2695262 1.5154828 1.2441958 0.0947943 0.0123967 0.1881924 0.2025117 0.1315356 0.1747607 0.116694 0.8363995 -0.3793239 -0.0696706 -0.1292928 -0.2409719 0.0924428 -0.1138212 -0.4336664 -0.1075826 -0.1253777 -0.1035602 -0.0214259 -0.011002 -0.0009772 0.09446 -0.0184535 0.0413095 -0.0152933 -0.034248 0.7834144 -0.0050817 -0.1745793 0.0012624 0.2160863 -0.0042795 -0.1775203 -0.0051822 0.2838124 0.0790838 -0.0083799 -0.029522 0.000133 0.1130525 -0.0650604 -0.0390469 -0.038822 -0.0061963 0.1498435 0.0149677 0.0207138 0.0571243 0.0033994 -0.0029373 0.0205994 -0.0133617 0.0991015 0.0490019 -0.0261496 0.0026718 -0.006221 0.0372306 0.1066877 0.0910931 0.086991 -0.0047748 0.0556862 0.0327908 -0.0046895 0.0696733 -0.0197463 -0.0646775 0.0741338 -0.0422408 0.0837458 0.0808258 0.0089826 -0.0139586 0.0080718 0.0254317 0.0721291 -0.0117771 0.0765819 -0.013291 0.0608114 0.0031697 0.0046219 0.0078729 -0.0717257 -0.0570295 0.0046325 -0.0596525 0.0614509 0.7004885 -0.0835009 0.0547836 -0.1207978 0.3187127 -0.0051774 0.0393923 0.0123198 0.3794821 -0.0233781 -0.0020559 0.058688 0.0138286 0.0188367 0.105893 0.013262 0.0790547 -0.0735212 -0.0192465 0.0410399 0.0666254 0.0056153 -0.0793652 -0.0811026 0.0346848 -0.0625803 0.0335211 unknown
polarizability: 146.8029054|2.5380252|106.4613569|-5.2287144|12.3060163|111.6621974 unknown
InChI: InChI=1S/C8H9Cl3F4O2/c9-3-1-2-5(16)4-6(17,7(10,12)13)8(11,14)15/h17H,1-4H2
charge 0 multiplicity 1
26 atoms
Cl 3.039906 2.555241 0.05632
Cl 1.56045 -2.085792 -1.605142
Cl -6.428245 0.239525 0.240068
F  3.92195 0.048665 0.041226
F  2.787216 0.691784 -1.810431
F  0.121426 -1.779416 0.602958
F  2.347181 -1.996801 0.936306
O  1.486795 0.530123 1.61105
O  -1.133798 0.887055 1.434984
C  1.465982 0.203786 0.214204
C  0.258519 0.817789 -0.560498
C  2.800819 0.768329 -0.390429
C  1.405227 -1.376267 0.120802
C  -1.078972 0.701947 0.183072
C  -2.310455 0.395337 -0.644821
C  -3.63217 0.486745 0.145954
C  -4.820277 0.109523 -0.740524
H  0.190561 0.392253 -1.574388
H  0.460452 1.902632 -0.671222
H  -2.31307 1.069043 -1.5282
H  -2.163157 -0.625515 -1.061417
H  -3.586614 -0.18155 1.023265
H  -3.765227 1.510786 0.538296
H  0.537069 0.732228 1.904005
H  -4.947491 0.790783 -1.596611
H  -4.775778 -0.934531 -1.088328
