program: Gaussian 09
title: 000294322
version: EM64L-G09RevD.01
frameworkgroup: C1[X(C12H17ClN2O)]
method: RPBEPBE
basis: SDD
operation: Freq
keyword: #p
keyword: freq=noraman
keyword: PBEPBE/SDD
title: #p freq=noraman PBEPBE/SDD
converged: YES YES NO NO
title: Mulliken charges:
elementType: Cl O N N C C C C C C C C C C C C H H H H H H H H H H H H H H H H H
charge: -0.092228 -0.301747 -0.462609 -0.409160 0.174883 0.507901 -0.741005 -0.752911 -0.402971 -0.385622 0.321096 -0.240643 -0.244679 -0.245433 -0.338539 -0.547553 0.213179 0.279940 0.201367 0.243547 0.211739 0.232621 0.288989 0.235875 0.235664 0.221107 0.222109 0.291284 0.225970 0.266352 0.241040 0.264038 0.286401
chargesum: 0.00000
title: Mulliken charges with hydrogens summed into heavy atoms:
elementType: Cl O N N C C C C C C C C C C C C
charge: -0.092228 -0.301747 -0.173620 -0.117876 0.174883 0.507901 -0.046519 -0.065004 -0.167096 -0.149958 0.321096 -0.019536 -0.022570 -0.019463 0.168853 0.002886
polarizability: 1.67182122e+02 4.33058285e+00 1.52675966e+02 -2.09836529e+01 -2.87770633e-01 1.31121627e+02
1716.lowfreq: -6.2929 -0.0020 -0.0004 0.0021 5.1655 12.2157 13.3266 28.8222 39.6451
frequency: 12.5436 28.7449 39.6396 57.4907 69.2441 102.4134 131.5124 147.6980 214.4657 228.0700 254.9543 265.6945 282.6598 292.1281 323.1961 332.1647 349.6357 362.5729 402.0670 409.1311 456.7781 506.6472 521.9417 552.6011 565.8634 595.2593 617.1697 699.0333 702.2971 713.9187 720.3171 770.9397 837.8101 849.2365 888.0288 913.6026 923.9616 930.6897 973.1790 975.1002 988.6859 990.3711 993.0111 1009.9799 1026.4280 1047.0349 1081.7255 1106.7167 1137.4978 1162.5355 1171.2950 1172.4194 1192.3032 1207.1264 1229.2752 1245.4314 1260.2946 1301.9951 1318.0042 1368.9550 1372.0342 1379.9730 1389.2673 1429.6058 1434.3771 1439.5418 1447.7316 1463.9294 1468.4267 1480.4424 1483.6344 1494.4484 1497.1357 1592.6424 1613.1828 1630.6335 2974.3076 2991.5212 2997.7920 3055.5679 3064.6961 3069.0730 3081.5649 3099.9634 3114.9982 3117.1365 3126.0354 3138.8034 3152.6492 3153.3884 3165.9693 3534.7020 3545.3469
redmass: 8.0340 3.9256 4.4260 6.6634 6.8207 3.4506 3.5239 3.8259 2.1667 4.0957 1.2923 3.3409 2.2869 1.1886 2.2520 1.5392 2.7900 2.8430 2.8107 3.0441 2.4770 3.1089 1.4984 3.3391 3.1839 3.9279 6.3891 3.4867 1.8405 5.0309 6.7497 1.9266 2.1110 1.2519 2.6264 1.7155 1.8883 1.5246 1.9458 1.5798 2.0027 3.5862 1.5451 1.3690 2.4038 2.0117 1.6507 2.0587 2.0918 2.2506 1.1850 1.4205 1.1224 2.1252 1.7816 1.7220 2.9937 1.1907 1.3477 1.2900 1.2236 7.4324 1.2140 1.1659 2.1740 1.1014 1.3640 1.0657 1.1328 1.1220 1.8817 1.2292 1.6894 6.1334 6.1236 5.3399 1.0368 1.0360 1.0591 1.0842 1.0747 1.0993 1.0993 1.0984 1.1002 1.0848 1.0872 1.0933 1.1119 1.0955 1.0991 1.0775 1.0768
irintensity: 0.3176 0.0912 1.6563 1.7165 13.5567 8.0336 4.9041 1.1200 0.3586 6.3948 0.0953 2.5119 0.8903 0.2411 3.7244 9.4626 6.7529 29.9933 0.1921 0.5244 13.8147 9.8966 195.2560 9.2397 8.7314 28.9344 0.0261 11.3155 51.8294 2.2672 23.8387 39.0625 17.2398 0.2098 3.7266 2.1038 3.1422 5.9015 11.7247 5.1279 0.8805 0.3983 0.5456 0.9257 13.9358 0.7359 9.2536 7.9917 4.5688 57.2982 9.5532 24.7398 6.5017 11.9753 14.5266 111.3816 170.9681 45.3391 2.7588 4.6763 39.1386 2.5093 41.6507 37.6104 9.8528 15.1810 32.4641 6.9273 11.7022 68.7266 8.1186 71.0814 427.0363 2.2171 4.6969 133.4129 29.4366 31.4431 49.9724 8.2243 17.3791 30.6340 43.3144 24.9355 8.2114 4.5499 1.2573 32.1177 16.8602 39.0624 14.5225 10.4043 21.5777
temp: 298.150 k
press: 1.00000 atm
elementType: 17 8 7 7 6 6 6 6 6 6 6 6 6 6 6 6 1 1 1 1 1 1 1 1 1 1 1 1 1 1 1 1 1
symmnumber: 1
zpe: 711969.5 jmol-1
zpe.correction: 0.271175 hartree
zpe.thermalcorrener: 0.288143 hartree
zpe.thermalcorrenthalpy: 0.289087 hartree
zpe.thermalcorrgfe: 0.223989 hartree
zpe.sumelectzpe: -1111.073189 hartree
zpe.sumelectthermal: -1111.056221 hartree
zpe.sumelectthermalent: -1111.055277 hartree
zpe.sumelectthermalfe: -1111.120375 hartree
dipole: 0.1453 -1.4856 1.7251
dipole: 2.2812
quadrupole: -102.2705 -96.7383 -102.8906
quadrupole: 2.2973 3.6657 -5.5761
quadrupole: -1.6374 3.8948 -2.2574 2.2973 3.6657 -5.5761
hfenergy: -1111.3443641 hartree
pointgroup: C01 [X(C12H17Cl1N2O1)]
dipole: 0.0231475 -0.6199204 0.6486022 debye
polarizability: 165.7790936|3.7553949|151.6260473|-22.4753291|2.9304155|133.5745729 unknown
InChI: InChI=1S/C12H17ClN2O/c1-12(2,10-6-4-3-5-7-10)15-11(16)14-9-8-13/h3-7,14-15H,8-9H2,1-2H3
charge 0 multiplicity 1
33 atoms
Cl -4.791006 1.482599 1.207519
O  -0.982587 -0.513606 -1.539741
N  -0.493333 -1.347886 0.602591
N  -2.682393 -0.690878 0.061757
C  0.969754 -1.541159 0.385616
C  1.655142 -0.175231 0.127876
C  1.203143 -2.566112 -0.754617
C  1.525479 -2.12206 1.718353
C  2.705649 -0.021654 -0.809059
C  1.28042 0.950471 0.906544
C  -1.351111 -0.831221 -0.365738
C  3.362555 1.220806 -0.964698
C  1.932332 2.192219 0.754665
C  2.982146 2.33344 -0.182771
C  -3.688479 -0.123569 -0.83361
C  -4.019517 1.339192 -0.529063
H  0.646216 -3.493201 -0.529542
H  0.841262 -2.162123 -1.713402
H  2.272283 -2.828299 -0.843426
H  2.6149 -2.26999 1.636369
H  1.060871 -3.101771 1.942527
H  1.342231 -1.431969 2.562077
H  -0.888734 -1.736793 1.460148
H  3.00905 -0.862166 -1.44061
H  0.455907 0.855488 1.623005
H  4.167363 1.319356 -1.702336
H  1.621108 3.049477 1.362876
H  -2.92276 -0.755435 1.052725
H  3.489592 3.296893 -0.305747
H  -3.263559 -0.171166 -1.854652
H  -4.612707 -0.730138 -0.808746
H  -4.779657 1.747222 -1.212125
H  -3.122462 1.973962 -0.500167
