program: Gaussian 09
title: 000294319
version: EM64L-G09RevD.01
frameworkgroup: C1[X(C13H12F6N2O)]
method: RPBEPBE
basis: SDD
operation: Freq
keyword: #p
keyword: freq=noraman
keyword: PBEPBE/SDD
title: #p freq=noraman PBEPBE/SDD
converged: YES YES NO NO
title: Mulliken charges:
elementType: F F F F F F O N N C C C C C C C C C C C C C H H H H H H H H H H H H
charge: -0.166946 -0.121099 -0.158472 -0.146379 -0.160865 -0.123724 -0.415177 -0.208153 -0.285418 0.048160 -0.634355 0.378195 0.259650 0.376300 0.366689 -0.391070 0.090746 -0.371244 -0.350204 -0.649145 -0.224481 -0.219894 0.276400 0.296181 0.232198 0.231384 0.404227 0.239717 0.256290 0.242464 0.227524 0.237314 0.230148 0.233038
chargesum: 0.00000
title: Mulliken charges with hydrogens summed into heavy atoms:
elementType: F F F F F F O N N C C C C C C C C C C C C C
charge: -0.166946 -0.121099 -0.158472 -0.146379 -0.160865 -0.123724 -0.010950 -0.208153 -0.285418 0.048160 -0.061774 0.378195 0.259650 0.376300 0.366689 0.072512 0.090746 -0.131527 -0.093914 0.058158 0.005667 0.013144
polarizability: 2.15027908e+02 -9.13688950e+00 1.61309119e+02 1.23082988e+01 -1.52069223e+01 1.02241106e+02
1716.lowfreq: -7.5447 -3.6353 -0.0010 -0.0009 -0.0007 5.7095 18.9214 30.7869 37.8766
frequency: 18.5127 30.6352 37.8214 48.6679 59.9579 89.7521 108.9315 123.5721 136.9054 185.6659 199.5843 215.0344 230.5027 242.9546 259.2868 281.5563 288.4550 290.7269 300.2345 315.4310 361.4281 404.5601 412.1082 434.9190 456.6499 463.4440 484.9822 507.3146 542.7628 554.8470 567.6772 586.4286 598.3606 629.1779 652.2307 682.3305 702.0224 734.1197 755.9125 765.7225 781.7030 837.1966 857.7826 881.6066 905.6925 923.0975 940.1229 952.2930 966.2054 982.0608 986.8590 999.2982 1010.6484 1042.0272 1049.4594 1077.6069 1084.5050 1091.9752 1101.1937 1134.9990 1149.9577 1160.9732 1172.3413 1182.2683 1228.8766 1255.6427 1276.4273 1290.3838 1324.6606 1332.9662 1344.0696 1396.1537 1403.8894 1425.3533 1445.4257 1456.0676 1467.9121 1474.7337 1481.4734 1491.9709 1498.7073 1575.3185 1600.3296 1631.7945 2378.5642 2995.9441 3013.4535 3019.2162 3068.1069 3090.0020 3096.9916 3103.9829 3136.2403 3147.9200 3162.4813 3176.0923
redmass: 11.8693 5.9267 8.1517 3.3504 8.8984 4.3049 5.0618 6.8793 11.0017 5.9139 1.3848 5.6359 5.7945 4.6667 7.4701 2.6058 7.3813 5.7455 5.8108 6.4252 4.7479 11.6492 3.7860 3.0612 16.7673 11.8145 15.0698 6.1273 6.2647 6.0442 5.0059 3.8587 6.2801 10.1089 7.4975 5.5887 5.1802 4.1690 1.4297 3.5506 1.3513 3.7908 1.4644 4.2818 5.0523 2.2632 1.3959 2.7860 2.4940 1.3381 2.4619 2.8520 2.0259 9.8272 9.7586 5.7786 2.5862 5.5685 2.2765 1.5281 3.6897 2.0532 1.3993 7.1511 1.9521 2.6920 1.3743 1.6787 1.7342 1.8682 1.3728 1.2107 3.7389 3.1451 2.0347 1.4567 1.0593 3.1017 1.1097 2.6159 1.4296 1.4438 4.5590 5.4692 1.0781 1.0357 1.0638 1.0608 1.1030 1.0975 1.0998 1.1021 1.0860 1.0905 1.0957 1.0996
irintensity: 0.2191 0.9437 0.0544 0.1104 0.2723 0.9362 2.0525 1.0115 2.3686 0.3253 0.2445 4.6782 1.2461 1.9976 0.1641 3.4673 3.0005 2.8698 0.1323 2.7017 36.5464 2.8574 6.7939 5.2520 4.4743 2.4777 0.1940 3.4534 1.9928 11.9479 5.0716 1.3850 17.6790 22.6173 6.6678 3.6209 4.0317 16.1936 80.6498 4.3544 15.0905 39.8625 0.3755 33.4561 2.9422 59.5218 2.0119 50.1102 11.4562 1.5813 40.1737 174.9840 13.0354 107.7388 215.2487 33.1916 60.8236 55.0840 3.7060 15.7326 164.5137 41.5208 9.4870 333.4435 26.7631 24.7783 12.3868 31.8995 29.0568 12.8006 10.8854 20.7209 10.7662 131.7746 64.1246 18.0466 17.7324 1.7439 1.6493 14.0022 35.6645 228.4671 23.6364 7.6174 1532.0011 13.9803 0.6062 27.5697 3.5306 2.3142 30.5628 24.8458 0.2997 10.6025 17.0140 14.1273
temp: 298.150 k
press: 1.00000 atm
elementType: 9 9 9 9 9 9 8 7 7 6 6 6 6 6 6 6 6 6 6 6 6 6 1 1 1 1 1 1 1 1 1 1 1 1
symmnumber: 1
zpe: 621006.7 jmol-1
zpe.correction: 0.236529 hartree
zpe.thermalcorrener: 0.256727 hartree
zpe.thermalcorrenthalpy: 0.257671 hartree
zpe.thermalcorrgfe: 0.186026 hartree
zpe.sumelectzpe: -1284.752626 hartree
zpe.sumelectthermal: -1284.732429 hartree
zpe.sumelectthermalent: -1284.731484 hartree
zpe.sumelectthermalfe: -1284.803129 hartree
dipole: 6.8350 4.3220 -2.4166
dipole: 8.4402
quadrupole: -125.6914 -119.3413 -129.9124
quadrupole: -0.2856 1.7421 -5.8893
quadrupole: -0.7097 5.6404 -4.9307 -0.2856 1.7421 -5.8893
hfenergy: -1284.9891552 hartree
pointgroup: C01 [X(C13H12F6N2O1)]
dipole: -2.5827047 2.0065466 0.5744116 debye
polarizability: 216.0497389|8.522985|163.7847274|10.9255507|1.7429287|98.7436669 unknown
InChI: InChI=1S/C13H12F6N2O/c1-2-21-9-6-4-3-5-8(9)20-10(21)7-11(22,12(14,15)16)13(17,18)19/h3-6,22H,2,7H2,1H3
charge 0 multiplicity 1
34 atoms
F  2.564303 1.312128 -1.460965
F  2.89339 -0.824803 -2.145744
F  0.793283 -0.006471 -1.955724
F  3.232602 -0.979207 2.160358
F  3.889781 0.807164 0.936688
F  4.305496 -1.296371 0.195909
O  1.497557 -1.860708 0.145327
N  -1.446151 1.133303 0.538344
N  -0.883647 -1.07161 0.531418
C  1.953429 -0.51292 0.137175
C  1.023129 0.485492 0.926874
C  -0.427646 0.194217 0.663488
C  -2.636313 0.414353 0.290402
C  2.076455 -0.02221 -1.352667
C  3.351458 -0.507053 0.837384
C  -1.316636 2.604963 0.5381
C  -2.266011 -0.97107 0.288517
C  -3.964915 0.836128 0.07947
C  -3.237274 -1.971812 0.070301
C  -1.084689 3.179385 -0.875202
C  -4.924866 -0.175099 -0.136269
C  -4.567118 -1.555704 -0.141537
H  1.290835 1.52555 0.681149
H  1.228201 0.334344 2.003208
H  -2.238735 3.020476 0.982027
H  -0.488142 2.882954 1.212807
H  0.445275 -1.843391 0.294374
H  -4.251022 1.892885 0.074965
H  -2.958534 -3.029441 0.067433
H  -0.147623 2.796201 -1.314998
H  -1.019167 4.280892 -0.826888
H  -1.913083 2.910523 -1.552917
H  -5.969431 0.106388 -0.306778
H  -5.345491 -2.306079 -0.315028
