program: Gaussian 09
title: 000294292
version: EM64L-G09RevD.01
frameworkgroup: C1[X(C9H12F6O3S)]
method: RPBEPBE
basis: SDD
operation: Freq
keyword: #p
keyword: freq=noraman
keyword: PBEPBE/SDD
title: #p freq=noraman PBEPBE/SDD
converged: NO YES NO NO
title: Mulliken charges:
elementType: S F F F F F F O O O C C C C C C C C C H H H H H H H H H H H H
charge: 0.982208 -0.152265 -0.118567 -0.140556 -0.138511 -0.123815 -0.154494 -0.440960 -0.401781 -0.486190 -0.037783 0.306355 -0.667352 0.083268 -0.739477 -0.718274 -0.720160 0.378150 0.378278 0.270768 0.331887 0.303856 0.221167 0.229891 0.219836 0.233673 0.213918 0.215452 0.209439 0.216518 0.245523
chargesum: 0.00000
title: Mulliken charges with hydrogens summed into heavy atoms:
elementType: S F F F F F F O O O C C C C C C C C C
charge: 0.982208 -0.152265 -0.118567 -0.140556 -0.138511 -0.123815 -0.154494 -0.440960 -0.401781 -0.486190 0.232985 0.306355 -0.031609 0.083268 -0.068583 -0.055231 -0.048680 0.378150 0.378278
polarizability: 1.45517240e+02 1.24888598e+00 1.33613661e+02 -2.29454064e+00 -2.57969360e+00 1.10950927e+02
1716.lowfreq: -8.0071 -3.9236 -0.0008 0.0002 0.0005 4.0511 29.3996 41.5332 54.1419
frequency: 29.0003 41.4851 54.1261 58.7194 81.5773 92.2915 134.7749 144.2643 172.7203 185.7469 203.2078 213.2984 225.4582 238.3862 247.6478 260.7186 268.9569 278.3825 290.5893 304.8176 316.6058 323.7734 325.0728 365.9077 381.7056 416.6368 428.3985 451.4735 459.6777 470.4212 490.0150 491.5625 562.9043 572.6770 598.6818 615.2470 638.1157 688.4224 746.3932 789.0422 852.4175 881.6665 923.4794 927.8189 932.2789 940.4518 947.0814 988.2146 1003.6071 1018.9306 1022.1017 1042.9347 1050.8475 1068.2668 1095.0850 1114.0430 1151.6627 1171.0755 1203.9337 1221.0678 1248.9494 1272.5930 1305.1307 1326.6756 1371.6861 1381.3277 1383.8486 1408.2721 1453.7352 1459.6758 1462.0751 1467.9854 1484.3888 1489.3471 1496.6274 2972.3778 2977.8232 2987.0076 3016.0104 3048.9581 3065.8103 3071.2613 3074.8554 3079.6291 3091.0414 3094.9650 3113.4686
redmass: 6.3428 4.7036 5.9136 13.1594 7.5999 7.0498 10.8491 8.4980 6.5626 1.6825 2.1255 2.8161 5.2345 2.1733 1.7978 1.7387 6.3324 6.8048 10.1204 4.3935 4.1519 2.7409 7.7050 2.4070 5.1026 6.7944 3.6850 7.7527 15.6713 7.1038 4.6633 12.9880 6.3469 5.5960 7.2973 7.4064 9.3114 7.2675 4.5615 3.9973 4.6318 4.0100 2.8182 1.6591 3.6252 1.9813 1.4400 12.2587 2.0083 1.7500 4.0209 2.6479 5.3987 6.8295 7.0765 4.2797 4.2723 7.9459 2.2363 3.0039 2.4970 1.5519 1.2412 1.3944 1.2605 1.2241 1.2246 1.2030 1.0745 1.0499 1.0486 1.0498 1.0557 1.0556 1.0601 1.0361 1.0363 1.0366 1.0851 1.0597 1.0995 1.0986 1.0992 1.0981 1.0997 1.0990 1.1022
irintensity: 0.0432 0.0544 0.1046 0.2317 0.0837 0.3347 2.5984 1.6632 1.8500 0.3373 0.2252 0.5912 1.4833 1.1032 0.1859 1.1116 2.9503 2.8403 14.0816 8.5428 6.0857 1.4523 8.4512 1.8630 7.3892 10.9655 5.6835 3.2468 3.6918 28.8153 6.3608 1.0652 64.3994 18.2612 10.2293 35.3784 26.8946 0.4249 18.2037 40.2532 58.2274 71.0386 20.0066 4.1895 24.1020 42.3118 20.7986 35.8298 18.3622 26.6059 62.6775 220.9714 198.0361 71.7293 62.1686 16.2964 113.4166 299.5249 22.0693 10.1703 7.3006 3.6420 17.7827 8.0203 12.7820 35.8088 23.1964 12.7110 18.1136 0.4699 7.6718 0.4995 11.9661 17.5042 28.8355 22.3802 28.5420 12.4203 4.6691 0.1536 7.6022 38.0245 2.6640 71.2653 5.9692 45.7429 0.0275
temp: 298.150 k
press: 1.00000 atm
elementType: 16 9 9 9 9 9 9 8 8 8 6 6 6 6 6 6 6 6 6 1 1 1 1 1 1 1 1 1 1 1 1
symmnumber: 1
zpe: 549213.9 jmol-1
zpe.correction: 0.209185 hartree
zpe.thermalcorrener: 0.229851 hartree
zpe.thermalcorrenthalpy: 0.230795 hartree
zpe.thermalcorrgfe: 0.160185 hartree
zpe.sumelectzpe: -1571.334810 hartree
zpe.sumelectthermal: -1571.314144 hartree
zpe.sumelectthermalent: -1571.313199 hartree
zpe.sumelectthermalfe: -1571.383809 hartree
dipole: -4.1874 -1.2252 0.3430
dipole: 4.3764
quadrupole: -120.2455 -121.0293 -119.2704
quadrupole: 3.5220 -1.7712 -6.4587
quadrupole: -0.0638 -0.8476 0.9113 3.5220 -1.7712 -6.4587
hfenergy: -1571.5439943 hartree
pointgroup: C01 [X(C9H12F6O3S1)]
dipole: -1.6728995 -0.3606174 -0.1898499 debye
polarizability: 145.5702118|2.4581513|122.7821162|-1.4647204|11.4970216|121.729499 unknown
InChI: InChI=1S/C9H12F6O3S/c1-6(2,3)5-4-7(8(10,11)12,9(13,14)15)18-19(16)17-5/h5H,4H2,1-3H3
charge 0 multiplicity 1
31 atoms
S  -0.533103 2.293721 0.882904
F  2.373895 -1.969548 0.508348
F  3.40554 0.031626 0.800736
F  1.787919 -0.612918 2.231397
F  0.640258 0.803957 -2.301939
F  2.751677 0.173476 -1.818069
F  1.124153 -1.389581 -2.016591
O  -1.611373 1.438632 -0.305535
O  1.116438 1.472871 0.307781
O  -0.823051 1.749777 2.36284
C  -1.529135 -0.071715 -0.423423
C  -2.898425 -0.694055 -0.005797
C  -0.301866 -0.636319 0.321717
C  1.058385 0.049868 -0.004214
C  -2.850606 -2.221189 -0.300856
C  -3.228582 -0.451548 1.487604
C  -3.993638 -0.043105 -0.894379
C  2.173056 -0.615639 0.876741
C  1.407742 -0.087581 -1.530923
H  -1.409194 -0.205289 -1.515625
H  -0.455023 -0.558602 1.410231
H  -0.21063 -1.703646 0.065607
H  -2.192817 -2.764446 0.401965
H  -3.864885 -2.646277 -0.19578
H  -2.508099 -2.429019 -1.332901
H  -3.250547 0.625684 1.727039
H  -2.503286 -0.934587 2.167186
H  -4.224501 -0.872362 1.715636
H  -3.821867 -0.260005 -1.966085
H  -4.987995 -0.44069 -0.621472
H  -4.009639 1.05271 -0.766047
