program: Gaussian 09
title: 000294313
version: EM64L-G09RevD.01
frameworkgroup: C1[X(C18H23NO5)]
method: RPBEPBE
basis: SDD
operation: Freq
keyword: #p
keyword: freq=noraman
keyword: PBEPBE/SDD
title: #p freq=noraman PBEPBE/SDD
converged: YES YES NO NO
title: Mulliken charges:
elementType: O O O O O N C C C C C C C C C C C C C C C C C C H H H H H H H H H H H H H H H H H H H H H H H
charge: -0.273706 -0.213450 -0.283131 -0.280098 -0.290109 -0.400833 0.207200 -0.465081 -0.463061 -0.398614 -0.395121 -0.390003 0.457381 0.185192 -0.722664 0.542075 -0.541159 -0.586156 0.300889 0.281626 0.036065 -0.533024 -0.499113 -0.521910 0.230589 0.202998 0.208148 0.223761 0.230051 0.200233 0.199478 0.229992 0.188754 0.208115 0.249649 0.223281 0.286686 0.280607 0.223370 0.227564 0.245374 0.252328 0.229733 0.205658 0.205573 0.264184 0.230679
chargesum: 0.00000
title: Mulliken charges with hydrogens summed into heavy atoms:
elementType: O O O O O N C C C C C C C C C C C C C C C C C C
charge: -0.273706 -0.213450 -0.283131 -0.280098 -0.290109 -0.400833 0.207200 -0.031494 -0.031153 0.031671 0.034349 0.006866 0.457381 0.185192 -0.249735 0.542075 -0.254472 -0.305549 0.300889 0.281626 0.036065 0.163284 0.188607 0.178527
polarizability: 3.00202129e+02 8.81317183e+00 2.22394906e+02 4.93796495e+00 8.58728848e+00 1.56114339e+02
1716.lowfreq: -24.8944 -11.4249 0.0004 0.0005 0.0009 6.6494 10.8798 25.1696 45.1889
frequency: -19.3376 24.4169 45.1812 51.4248 67.6505 82.5106 99.0966 103.7838 112.2080 122.7436 151.0401 164.2015 170.4108 179.9730 199.7359 202.6923 210.8577 235.9132 253.5336 261.7519 267.8207 283.0583 290.2241 309.0085 359.4203 361.2796 387.4939 391.6689 415.9789 449.4055 471.3933 482.5357 507.3515 517.0894 566.3371 579.0101 596.8491 603.7693 615.4126 645.9951 675.0829 679.4623 697.5543 709.7501 740.8176 755.5876 772.6089 814.5568 828.4103 844.4244 846.6500 862.4157 864.8365 872.9695 905.9905 910.1608 924.0059 943.7902 946.8989 963.9528 1004.9961 1038.9166 1049.3412 1070.0069 1073.1268 1092.6264 1095.9153 1108.8103 1109.7247 1112.4087 1118.9599 1144.3463 1144.9154 1153.6525 1156.5585 1159.4833 1182.5637 1201.3110 1213.5170 1223.5382 1254.5186 1269.3508 1273.3214 1295.1065 1321.8286 1338.8959 1341.0894 1345.0164 1360.5497 1367.1303 1387.9348 1406.9955 1420.2669 1425.0054 1442.6223 1443.9915 1447.3840 1453.8667 1455.1463 1455.5207 1458.8701 1465.3894 1468.7937 1470.4871 1471.9309 1476.3805 1482.8098 1483.6952 1583.8554 1608.4718 1660.7556 1714.1239 2962.6398 2964.0275 2967.2057 2978.1165 2980.9658 2989.1389 2993.3360 2993.6387 3035.4887 3042.4790 3049.5697 3052.6096 3056.3420 3063.4271 3079.3980 3089.3981 3125.1305 3125.7370 3125.9939 3127.0867 3179.7486 3191.8404 3231.6477
redmass: 4.5430 4.1493 4.3156 3.0265 4.6344 3.4123 3.5165 1.6585 3.8459 4.5665 1.6500 3.6673 4.3795 1.4907 2.7224 2.0588 1.6767 4.8194 4.9006 2.1028 2.7582 2.8040 2.9389 4.9120 2.6442 2.6299 3.0022 4.7186 5.1216 4.2887 3.6036 4.9576 2.1312 5.8644 4.0457 4.3087 4.1882 6.1187 4.1433 4.6162 4.0789 2.2303 3.2436 2.4302 4.5466 3.8442 1.5176 3.0548 1.5212 2.8811 2.3948 1.5505 1.5761 5.1354 2.5532 2.4381 1.4276 2.3928 8.9330 6.6989 3.2703 2.8826 2.0227 1.6395 2.9184 2.6827 1.6355 1.2641 1.2390 1.2604 3.0453 1.7290 1.6756 1.3699 1.9715 1.7604 4.7274 2.2472 1.9365 1.5720 1.3764 1.5159 1.2751 3.2257 1.4261 1.3770 1.5033 1.4948 1.4793 7.6567 3.6632 2.3774 1.2270 1.1965 1.2644 1.0878 1.4262 1.1223 1.0941 1.1737 1.0851 1.0591 1.3232 1.0832 1.0541 1.0914 1.2368 1.5389 7.8700 6.8549 7.2787 11.9125 1.0327 1.0645 1.0360 1.0350 1.0606 1.0605 1.0612 1.0642 1.0956 1.0997 1.1009 1.1042 1.1027 1.1028 1.0954 1.0963 1.1043 1.0991 1.0624 1.1054 1.0911 1.0932 1.1147
irintensity: 1.1540 0.4781 1.7598 5.9583 1.5003 0.2138 4.0360 0.7771 1.2389 5.1583 0.4620 0.8763 4.1805 1.1885 1.5746 0.8712 0.1003 0.8870 11.7048 4.6624 0.7945 2.0671 2.0302 3.0422 3.7453 2.6671 2.6970 2.9247 0.7902 4.3365 1.0000 3.1264 2.7492 7.2494 2.5364 4.4050 5.1483 8.3253 23.8748 0.9080 19.7763 9.8044 14.4989 3.7202 7.1247 4.2965 0.9628 10.9795 41.3371 29.4990 10.2484 40.7824 14.2440 30.5649 70.0745 27.6229 7.0572 14.1016 53.8441 53.0577 30.8327 11.7437 9.8688 15.7641 134.5657 160.5031 6.7403 23.0012 1.4398 0.5601 85.2048 3.3337 5.4334 9.2162 34.3970 73.1140 68.6845 168.8842 29.9134 61.9508 15.4673 94.0116 12.9975 100.5975 1.2374 0.6323 2.1834 1.3968 2.6714 59.0235 12.5134 61.2036 8.5858 10.0482 1.2124 7.2250 54.5415 14.3574 2.6030 33.2774 9.5752 20.8615 132.6264 13.4876 26.1956 7.8814 74.0639 61.3075 120.9886 86.1530 339.0370 284.1884 58.7496 44.1781 75.2446 84.6544 10.6185 31.6566 51.8852 3.4178 73.0325 41.2302 10.5931 39.8479 6.8708 71.2528 34.9599 45.6538 14.7058 22.6758 0.3937 20.1259 1.0086 0.9376 11.3593
temp: 298.150 k
press: 1.00000 atm
elementType: 8 8 8 8 8 7 6 6 6 6 6 6 6 6 6 6 6 6 6 6 6 6 6 6 1 1 1 1 1 1 1 1 1 1 1 1 1 1 1 1 1 1 1 1 1 1 1
symmnumber: 1
zpe: 999545.4 jmol-1
zpe.correction: 0.380707 hartree
zpe.thermalcorrener: 0.403822 hartree
zpe.thermalcorrenthalpy: 0.404767 hartree
zpe.thermalcorrgfe: 0.328689 hartree
zpe.sumelectzpe: -1128.727157 hartree
zpe.sumelectthermal: -1128.704042 hartree
zpe.sumelectthermalent: -1128.703097 hartree
zpe.sumelectthermalfe: -1128.779175 hartree
dipole: -0.2946 5.3176 0.5048
dipole: 5.3496
quadrupole: -116.1144 -135.8107 -148.4217
quadrupole: 5.3089 14.8803 -6.4741
quadrupole: 17.3345 -2.3618 -14.9728 5.3089 14.8803 -6.4741
hfenergy: -1129.107864 hartree
pointgroup: C01 [X(C18H23N1O5)]
dipole: -0.168679 2.0976921 -0.0312738 debye
polarizability: 299.5013904|11.2036605|223.9865806|6.4319161|1.5707274|155.223404 unknown
InChI: InChI=1S/C18H23NO5/c1-12-18(8-6-5-7-9-18)24-17(20)19(12)13-10-14(21-2)16(23-4)15(11-13)22-3/h10-11H,1,5-9H2,2-4H3
charge 0 multiplicity 1
47 atoms
O  2.944603 -1.068201 -0.716534
O  1.065746 -2.204237 -1.522666
O  -3.293423 2.304305 -0.582047
O  -3.359171 -2.43458 0.674144
O  -4.776019 0.08437 0.172652
N  0.886006 -0.288155 -0.098795
C  3.197249 0.170403 0.119622
C  4.126627 -0.239117 1.28138
C  3.851603 1.223677 -0.807115
C  5.52283 -0.675809 0.780033
C  5.246242 0.772259 -1.297465
C  6.169922 0.411966 -0.109976
C  1.789862 0.577371 0.572886
C  1.559531 -1.284691 -0.851274
C  1.4830 1.562761 1.455048
C  -0.550607 -0.196788 -0.049132
C  -1.311463 -1.325789 0.285039
C  -1.173354 1.035463 -0.367675
C  -2.579057 1.120949 -0.327993
C  -2.727548 -1.247394 0.296098
C  -3.381706 -0.016906 0.003221
C  -2.516855 3.523131 -0.825542
C  -4.730182 -2.737054 0.225511
C  -5.56601 0.487053 -1.012437
H  3.643162 -1.047988 1.859028
H  4.223439 0.632323 1.9591
H  3.936052 2.167812 -0.232618
H  3.177027 1.42018 -1.661455
H  5.417724 -1.611145 0.197997
H  6.169218 -0.90165 1.649323
H  5.697667 1.575613 -1.910338
H  5.127251 -0.112331 -1.95153
H  6.364452 1.320965 0.497471
H  7.149872 0.060851 -0.485167
H  0.452835 1.785962 1.742219
H  2.277687 2.148877 1.922734
H  -0.843461 -2.287479 0.504058
H  -0.558095 1.89401 -0.644764
H  -1.914228 3.439463 -1.750663
H  -1.85469 3.752009 0.031438
H  -3.265418 4.32064 -0.940932
H  -5.468612 -2.120879 0.76093
H  -4.863204 -3.804784 0.459691
H  -4.832322 -2.579536 -0.865537
H  -5.453057 -0.259643 -1.823601
H  -5.254645 1.483204 -1.365827
H  -6.610483 0.511138 -0.66564
