program: Gaussian 09
title: 000294316
version: EM64L-G09RevD.01
frameworkgroup: C1[X(C15H24F6O2)]
method: RPBEPBE
basis: SDD
operation: Freq
keyword: #p
keyword: freq=noraman
keyword: PBEPBE/SDD
title: #p freq=noraman PBEPBE/SDD
converged: YES YES NO NO
title: Mulliken charges:
elementType: F F F F F F O O C C C C C C C C C C C C C C C H H H H H H H H H H H H H H H H H H H H H H H H
charge: -0.136772 -0.135115 -0.137952 -0.137632 -0.156675 -0.129382 -0.458824 -0.449463 -0.119339 -0.003618 -0.118451 -0.474981 -0.421620 -0.412358 -0.407039 -0.376948 0.346311 0.345061 -0.391023 -0.403638 -0.407373 -0.390096 -0.411960 0.242899 0.216011 0.255875 0.241466 0.234783 0.219305 0.196813 0.215846 0.190619 0.201392 0.203763 0.197788 0.197778 0.200117 0.196737 0.199004 0.203427 0.207819 0.196080 0.195375 0.207914 0.212693 0.389545 0.365835
chargesum: 0.00000
title: Mulliken charges with hydrogens summed into heavy atoms:
elementType: F F F F F F O O C C C C C C C C C C C C C C C
charge: -0.136772 -0.135115 -0.137952 -0.137632 -0.156675 -0.129382 -0.069279 -0.083628 0.123560 -0.003618 0.097561 0.022361 0.032469 0.000301 -0.015027 0.024603 0.346311 0.345061 0.006872 -0.007897 0.003874 0.001359 0.008647
polarizability: 1.95801835e+02 -8.49862400e-01 1.64399518e+02 -5.57998830e+00 1.51737325e+00 1.46094888e+02
1716.lowfreq: -13.1789 -0.0012 -0.0010 -0.0004 6.2238 9.3921 22.0156 47.6614 61.6437
frequency: 21.6284 47.6208 61.5372 64.1230 80.0779 102.0435 110.5771 132.9370 146.4715 150.8755 167.1125 179.4073 185.7282 205.0645 222.8794 242.1050 248.5622 261.2465 262.2158 288.8225 289.3397 291.5496 299.9820 319.6179 320.4241 344.3205 368.4493 371.3984 397.0950 415.4738 424.4778 432.7867 455.9847 465.1237 481.5288 493.9882 500.1379 506.3855 552.9796 608.4059 625.7904 649.4732 714.6507 719.4932 733.0884 753.5382 776.5348 806.2584 818.1392 833.9725 858.5973 878.3557 904.4349 919.4446 934.7091 943.3873 956.4457 962.1964 976.9346 1008.7536 1014.6337 1022.5479 1027.7755 1041.5801 1056.3722 1063.6677 1070.7674 1088.8043 1095.5062 1100.4726 1106.2948 1108.7330 1113.5283 1124.6199 1143.3470 1158.4890 1175.0628 1177.2135 1212.8840 1223.7682 1236.8074 1239.8327 1262.8952 1271.9817 1277.2272 1284.4567 1290.9751 1297.1713 1305.7113 1307.4982 1317.4429 1326.0967 1333.7378 1336.3873 1338.6225 1346.9461 1353.3408 1357.5503 1361.6123 1367.9120 1403.3797 1460.2559 1464.3437 1465.4963 1468.1393 1469.9715 1477.9579 1484.1937 1489.2127 1496.5559 1508.3974 2953.9637 2955.3987 2961.3748 2964.7499 2975.8526 2976.6661 2983.8110 2984.8948 3002.6716 3004.4390 3006.3154 3013.8907 3015.6762 3021.4347 3022.1438 3027.4933 3032.2824 3042.0358 3044.8705 3054.0100 3080.0443 3089.6041 3504.7821 3533.6452
redmass: 7.0134 6.7818 6.3748 8.3504 5.8536 3.5681 3.7375 3.4151 4.9982 3.7970 2.9054 4.4620 4.3191 4.5868 3.8915 2.4865 3.7423 6.6502 8.1233 2.7989 3.5330 6.6557 4.6227 2.8337 3.6771 2.1823 2.8337 2.1820 1.5920 8.1758 2.6595 2.6129 13.0416 6.7705 3.0221 2.4903 4.1479 1.2094 10.3717 3.3811 11.7597 9.5575 2.5356 2.0626 1.2963 1.4376 1.7918 1.8130 2.4514 2.3708 2.9754 3.5342 2.5595 2.2931 2.3080 2.4455 2.8130 2.2481 5.0677 2.3984 7.3266 3.3324 2.5556 2.1053 2.5490 3.4439 3.4311 2.6095 5.2097 3.1168 2.1658 3.0137 2.5526 3.5931 2.0483 1.6412 2.0629 1.2137 1.2354 1.2518 1.2784 1.3096 1.2356 1.2043 1.2459 1.2381 1.1599 1.1444 1.2411 1.2877 1.2531 1.2037 1.2813 1.3801 1.4353 1.3889 1.3672 1.3698 1.4393 1.3748 1.4788 1.0738 1.0854 1.0838 1.0796 1.0838 1.0938 1.0848 1.0707 1.0846 1.0714 1.0595 1.0596 1.0629 1.0629 1.0643 1.0663 1.0644 1.0670 1.0907 1.0928 1.0832 1.0749 1.0968 1.0906 1.0899 1.0773 1.0945 1.0965 1.0892 1.0966 1.0989 1.0952 1.0654 1.0659
irintensity: 0.2137 0.1620 0.0754 0.0373 0.3718 0.4604 0.1413 0.4777 0.4765 2.5271 0.8685 1.8487 0.6759 1.8540 1.1803 0.0916 0.6493 3.2767 0.4339 3.0066 8.0961 3.5517 0.7522 2.3634 5.4229 0.4385 6.1827 8.7860 68.7261 11.4884 4.5667 6.8168 0.3391 7.7869 2.4851 0.4427 16.1930 157.7031 3.2242 13.1385 29.6049 10.9282 5.3772 2.3177 20.4157 6.7632 27.1830 0.2457 13.7050 24.5497 34.9966 39.7147 63.4221 20.0189 21.1012 11.0463 21.5793 20.3027 33.8663 17.2830 18.8102 128.6630 41.2896 2.3139 10.7768 119.0426 123.3687 5.3547 87.5538 189.2440 18.6865 31.7658 36.4246 71.7056 70.1810 37.3611 27.5972 2.5120 11.1316 1.1743 0.8818 3.8527 5.3437 2.5498 5.3369 20.7538 5.4525 0.7584 65.0100 0.2570 0.8185 4.8589 1.6955 0.3571 1.8146 1.2576 1.2824 5.3592 1.1425 1.5229 39.8418 1.8296 7.2893 10.3948 5.1495 5.6524 10.7828 13.0892 2.5584 16.2713 19.5602 26.9737 29.8218 28.0069 22.5586 30.2571 24.0986 26.8391 24.2996 28.3148 42.3600 18.8561 21.0253 69.4598 1.1317 5.6215 4.1665 120.5952 69.7066 63.1068 95.4950 21.2488 30.2228 46.0147 35.1767
temp: 298.150 k
press: 1.00000 atm
elementType: 9 9 9 9 9 9 8 8 6 6 6 6 6 6 6 6 6 6 6 6 6 6 6 1 1 1 1 1 1 1 1 1 1 1 1 1 1 1 1 1 1 1 1 1 1 1 1
symmnumber: 1
zpe: 993348.6 jmol-1
zpe.correction: 0.378346 hartree
zpe.thermalcorrener: 0.402252 hartree
zpe.thermalcorrenthalpy: 0.403196 hartree
zpe.thermalcorrgfe: 0.326421 hartree
zpe.sumelectzpe: -1333.613713 hartree
zpe.sumelectthermal: -1333.589808 hartree
zpe.sumelectthermalent: -1333.588864 hartree
zpe.sumelectthermalfe: -1333.665639 hartree
dipole: 0.5926 0.7465 -0.0313
dipole: 0.9536
quadrupole: -133.4229 -140.8456 -144.3843
quadrupole: 0.4040 -9.8646 2.8892
quadrupole: 6.1280 -1.2946 -4.8334 0.4040 -9.8646 2.8892
hfenergy: -1333.9920599 hartree
pointgroup: C01 [X(C15H24F6O2)]
dipole: 0.2305123 -0.2957674 -0.0122307 debye
polarizability: 195.802529|0.0944533|164.0141905|5.6738797|2.971478|146.4795207 unknown
InChI: InChI=1S/C15H24F6O2/c16-14(17,18)13(23,15(19,20)21)11-9-7-5-3-1-2-4-6-8-10-12(11)22/h11-12,22-23H,1-10H2
charge 0 multiplicity 1
47 atoms
F  -2.649938 2.44158 -0.275092
F  -1.647431 1.62641 1.59485
F  -3.795116 1.124277 1.132058
F  -2.438671 -1.309006 1.714412
F  -4.089862 -1.226176 0.126845
F  -2.255904 -2.444542 -0.232154
O  -2.520049 0.162501 -1.669639
O  -0.059043 1.321488 -2.472083
C  -0.454672 0.008701 -0.371348
C  -2.026686 0.044553 -0.307575
C  0.100347 1.340978 -1.010188
C  0.113281 -1.238881 -1.128082
C  1.602363 1.545128 -0.740029
C  0.740545 -2.320313 -0.205835
C  1.920166 2.059546 0.683933
C  2.093554 -1.911085 0.432554
C  -2.523985 1.300766 0.542762
C  -2.679691 -1.236166 0.330001
C  3.431707 2.189697 1.021366
C  3.291195 -1.993716 -0.547754
C  4.177648 0.84475 1.260094
C  4.638013 -1.413533 -0.030999
C  4.730557 0.14029 -0.018987
H  -0.112826 -0.019265 0.680673
H  -0.435454 2.217966 -0.597434
H  0.871034 -0.87161 -1.841808
H  -0.670273 -1.688317 -1.759967
H  1.9545 2.285046 -1.484198
H  2.139277 0.607659 -0.955954
H  0.892784 -3.243735 -0.801111
H  0.025784 -2.589565 0.594661
H  1.452793 1.402776 1.447613
H  1.441862 3.053212 0.808014
H  2.304173 -2.571492 1.298014
H  2.005117 -0.88986 0.846582
H  3.513536 2.804418 1.940183
H  3.94401 2.76299 0.220994
H  3.036224 -1.48571 -1.501143
H  3.439127 -3.062907 -0.80692
H  3.502072 0.162272 1.810615
H  5.026675 1.028636 1.948154
H  5.442388 -1.805526 -0.685664
H  4.849842 -1.808564 0.984667
H  5.792124 0.433483 -0.142105
H  4.216554 0.527364 -0.919042
H  -3.512621 0.151833 -1.703112
H  -1.003134 1.07875 -2.668123
