program: Gaussian 09
title: 000294309
version: EM64L-G09RevD.01
frameworkgroup: C1[X(C18H34N2O2)]
method: RPBEPBE
basis: SDD
operation: Freq
keyword: #p
keyword: freq=noraman
keyword: PBEPBE/SDD
title: #p freq=noraman PBEPBE/SDD
converged: YES YES NO NO
title: Mulliken charges:
elementType: O O N N C C C C C C C C C C C C C C C C C C H H H H H H H H H H H H H H H H H H H H H H H H H H H H H H H H H H
charge: -0.246573 -0.269067 -0.084644 -0.349293 -0.326366 -0.350677 -0.338114 -0.384504 -0.382566 -0.347903 -0.379345 -0.317488 -0.327885 -0.404716 -0.392062 -0.377888 -0.536003 -0.375208 0.209882 -0.457533 -0.038251 -0.595883 0.168504 0.199367 0.210909 0.186701 0.190028 0.208919 0.219081 0.233814 0.183005 0.194033 0.203402 0.205436 0.201288 0.192486 0.194298 0.213283 0.213925 0.196118 0.214216 0.181559 0.258402 0.201574 0.199694 0.189235 0.240256 0.222210 0.204174 0.196707 0.297563 0.211486 0.195701 0.211380 0.212650 0.220683
chargesum: 0.00000
title: Mulliken charges with hydrogens summed into heavy atoms:
elementType: O O N N C C C C C C C C C C C C C C C C C C
charge: -0.246573 -0.269067 -0.084644 -0.051730 0.041505 0.046933 0.060834 0.068391 -0.005528 0.060935 0.014430 0.090093 0.082157 -0.008940 0.067913 0.011041 -0.073537 0.025673 0.209882 -0.050346 0.173129 -0.162551
polarizability: 2.41461815e+02 1.68144670e+01 2.21436267e+02 5.21257144e+00 -3.66952855e+00 1.76467788e+02
1716.lowfreq: -12.6121 -3.1588 -2.7191 -0.0004 -0.0003 0.0004 9.6921 12.7035 21.1069
frequency: -1.6731 11.6973 20.8429 21.8424 36.0251 40.1820 48.0992 53.0570 69.6591 78.7359 88.2332 99.6919 107.2727 131.6261 141.3021 146.5824 159.7867 174.4919 202.5140 230.5334 243.3804 251.4281 271.1408 304.2564 320.8788 360.0317 374.6316 387.0549 398.7754 403.6469 443.4515 462.0641 470.0770 478.7348 510.1794 535.0663 589.5501 609.0374 638.8439 673.1273 717.6037 727.3400 746.5642 758.8166 770.1915 799.3396 808.9263 830.4965 842.1369 860.5618 887.8664 892.1943 911.9537 919.2580 938.7518 942.8016 974.6213 982.8303 1002.5715 1005.9825 1008.3278 1021.6848 1027.8974 1032.5904 1053.0491 1054.0945 1063.7662 1070.9513 1077.0220 1080.2994 1082.3052 1092.4928 1098.4258 1108.8504 1125.1909 1131.3759 1154.3031 1173.3996 1177.0539 1191.9657 1210.6879 1211.6296 1217.8108 1239.1228 1249.5748 1252.3765 1256.9594 1267.3533 1270.6146 1275.7317 1281.4142 1286.4166 1291.5013 1292.7922 1296.5487 1297.7518 1300.8905 1315.8426 1321.6977 1326.3110 1332.3773 1345.0243 1346.9334 1354.7598 1358.9782 1360.3145 1365.4616 1371.8014 1390.1326 1425.0866 1443.5279 1444.8489 1446.6159 1450.9814 1455.5818 1455.8363 1457.7381 1459.6256 1462.0477 1462.6719 1464.4809 1471.6873 1478.5397 1479.5727 1485.2592 1486.9355 1614.8569 1657.4207 2814.5389 2846.1353 2862.0605 2946.5812 2950.6895 2952.0617 2952.8935 2956.5175 2957.4057 2960.1233 2965.1257 2970.2375 2983.6265 2990.2465 2992.5603 2996.7249 2999.7784 3003.4388 3004.2627 3011.4777 3023.6734 3024.7916 3038.1774 3041.9540 3044.5535 3066.2204 3069.4671 3075.8886 3076.4410 3079.4992 3082.3937 3089.7632 3192.9863 3557.0001
redmass: 2.3236 4.0089 5.0260 3.9886 4.6085 3.1813 3.2586 3.9924 3.7588 1.9478 3.1905 2.6540 3.0865 2.0688 2.3577 2.2494 2.5507 3.2950 2.7782 3.5298 1.7875 3.8319 2.6412 2.3510 2.3127 2.5928 2.6541 3.3045 2.6395 2.0164 3.1564 2.5272 2.8218 3.2027 2.6200 1.4100 2.4350 2.0591 1.5441 2.4418 1.0692 1.1412 1.7849 1.3089 2.1804 1.8541 2.5079 1.6825 1.5834 2.1525 1.4873 2.4848 2.3286 1.9526 1.6663 1.4470 1.6295 2.6423 1.1397 2.5488 2.8246 2.8640 2.1530 1.7371 1.5553 2.0991 2.7174 2.3443 2.7080 2.2062 2.5820 2.8780 3.0299 2.2754 2.1829 2.5361 2.4436 1.3210 1.9854 1.0636 1.2966 1.5039 1.3444 1.5080 1.3274 1.3756 1.3081 1.4571 1.3390 1.1217 1.1643 1.1443 1.2384 1.1504 1.1801 1.1955 1.2210 1.3121 1.2625 1.3750 1.2808 1.4755 1.2840 1.6534 1.3425 1.5423 1.3572 1.2650 1.4649 1.1769 1.1550 1.0817 1.0877 1.0918 1.0884 1.0962 1.0904 1.0789 1.0710 1.0898 1.0842 1.0961 1.1000 1.1056 1.3365 1.3521 6.4754 4.7419 1.0702 1.0703 1.0688 1.0592 1.0593 1.0614 1.0624 1.0661 1.0600 1.0661 1.0599 1.0597 1.0957 1.0723 1.0927 1.0871 1.0630 1.0609 1.0958 1.0989 1.0896 1.1014 1.1030 1.0887 1.1033 1.0998 1.0800 1.0975 1.1022 1.0977 1.0977 1.0734 1.1146 1.0775
irintensity: 0.1144 0.5758 1.0300 2.7825 5.2972 0.1166 0.5243 4.1651 0.3718 0.2986 0.9812 0.8232 1.0928 0.0777 0.1905 0.0702 0.9983 3.5089 0.8519 7.3223 1.9810 0.3986 0.4321 10.4552 10.1358 3.6021 5.3037 1.8354 0.1100 2.0207 4.1658 1.0158 1.2051 12.1200 10.9734 123.0890 18.5811 7.5117 17.0722 3.5739 17.7162 0.3178 4.1922 4.4532 13.4524 14.7177 8.4237 2.8804 0.2429 2.3955 1.4997 7.7493 6.8351 2.2371 35.9156 55.7344 1.9142 0.9457 14.0011 21.7108 4.1888 0.2405 9.8734 8.6529 3.7706 29.9537 1.3778 7.1849 0.2458 0.0980 5.5375 4.2354 48.3149 0.5247 12.6100 57.2227 5.7501 11.2039 2.8195 1.7764 1.3746 2.2998 10.3021 10.9186 1.2213 7.4059 16.8956 36.5000 3.0099 1.7053 0.4312 1.3318 2.7038 1.2860 3.2504 27.7013 4.8681 2.7719 3.8013 1.0366 3.7419 0.7457 13.5683 0.1300 3.3745 0.5296 1.5410 2.0487 4.5843 3.8013 49.0225 1.3104 4.2221 27.4578 1.4904 21.6701 1.7926 0.9762 2.0915 0.3789 0.6162 4.6854 9.8057 5.4192 75.5784 106.9259 160.6382 20.6730 73.9439 93.0218 144.0833 2.2983 0.6018 8.1642 29.1441 31.6413 2.1534 103.9955 63.5440 109.5784 1.2629 22.9101 10.8904 25.8435 45.6447 18.3529 9.8596 7.3200 61.7998 0.9229 10.8550 29.8855 263.1429 47.0449 51.0782 35.1506 17.6424 26.0244 35.1031 7.9022 34.0411 8.9852
temp: 298.150 k
press: 1.00000 atm
elementType: 8 8 7 7 6 6 6 6 6 6 6 6 6 6 6 6 6 6 6 6 6 6 1 1 1 1 1 1 1 1 1 1 1 1 1 1 1 1 1 1 1 1 1 1 1 1 1 1 1 1 1 1 1 1 1 1
symmnumber: 1
zpe: 1304556.4 jmol-1
zpe.correction: 0.496879 hartree
zpe.thermalcorrener: 0.522017 hartree
zpe.thermalcorrenthalpy: 0.522961 hartree
zpe.thermalcorrgfe: 0.437301 hartree
zpe.sumelectzpe: -964.435418 hartree
zpe.sumelectthermal: -964.410280 hartree
zpe.sumelectthermalent: -964.409336 hartree
zpe.sumelectthermalfe: -964.494996 hartree
dipole: -1.4495 0.4325 -3.8984
dipole: 4.1816
quadrupole: -151.1472 -131.1091 -141.2239
quadrupole: -12.3827 18.9037 2.9814
quadrupole: -9.9871 10.0510 -0.0638 -12.3827 18.9037 2.9814
hfenergy: -964.9322971 hartree
pointgroup: C01 [X(C18H34N2O2)]
dipole: -0.5537561 -0.0911318 1.5464885 debye
polarizability: 239.2050008|-18.1144879|223.2780388|-5.9401569|-4.4126473|176.8828303 unknown
InChI: InChI=1S/C18H34N2O2/c1-2-3-4-5-6-7-8-9-11-18(21)19-12-10-13-20-14-16-22-17-15-20/h2,19H,1,3-17H2
charge 0 multiplicity 1
56 atoms
O  1.726803 -3.235332 0.28755
O  -4.096169 1.769935 -1.695088
N  -1.114679 -2.606908 0.130905
N  -4.174104 0.639355 0.332218
C  -2.376245 -1.926799 0.51688
C  -0.556336 -3.422429 1.242599
C  -0.081663 -1.66191 -0.368312
C  -3.208029 -1.456395 -0.693283
C  0.319614 2.362375 0.821184
C  -1.030094 2.583966 0.103682
C  1.47811 2.044745 -0.151278
C  0.69843 -4.17314 0.767971
C  1.173969 -2.428672 -0.813626
C  -2.192271 2.888577 1.074722
C  -4.475242 -0.666409 -0.284489
C  2.806832 1.713949 0.563971
C  -3.56607 3.031816 0.361202
C  3.958042 1.385738 -0.41271
C  -3.968307 1.780732 -0.431504
C  5.281036 1.022636 0.313927
C  6.427372 0.775871 -0.64411
C  7.131575 -0.37959 -0.748382
H  -2.169579 -1.055233 1.195033
H  -2.979635 -2.650773 1.10067
H  -1.320457 -4.153475 1.56913
H  -0.285521 -2.786758 2.124492
H  0.202688 -0.92396 0.426577
H  -0.481308 -1.096472 -1.22933
H  -3.507029 -2.342657 -1.284531
H  -2.611258 -0.810783 -1.362722
H  0.213791 1.526114 1.545222
H  0.576611 3.260671 1.420715
H  -0.936329 3.414947 -0.624984
H  -1.276146 1.681966 -0.492738
H  1.629483 2.904265 -0.836884
H  1.18822 1.186249 -0.792856
H  0.422985 -4.876538 -0.047192
H  1.168113 -4.728984 1.596362
H  1.980205 -1.734398 -1.104596
H  0.921204 -3.089005 -1.670828
H  -1.979996 3.829685 1.620419
H  -2.241807 2.091792 1.847099
H  -5.079392 -0.466311 -1.186296
H  -5.090797 -1.254899 0.422846
H  2.649977 0.851456 1.24521
H  3.103585 2.569317 1.206757
H  -3.525206 3.862204 -0.364161
H  -4.351007 3.272545 1.10556
H  3.663934 0.539373 -1.066268
H  4.132951 2.252658 -1.083466
H  -4.030539 0.690557 1.341504
H  5.12211 0.128981 0.948089
H  5.543989 1.859331 0.99637
H  6.684344 1.617841 -1.307978
H  7.947952 -0.494265 -1.470794
H  6.907891 -1.245855 -0.112961
