program: Gaussian 09
title: 000294310
version: EM64L-G09RevD.01
frameworkgroup: C1[X(C19H27N3O)]
method: RPBEPBE
basis: SDD
operation: Freq
keyword: #p
keyword: freq=noraman
keyword: PBEPBE/SDD
title: #p freq=noraman PBEPBE/SDD
converged: YES YES NO NO
title: Mulliken charges:
elementType: O N N N C C C C C C C C C C C C C C C C C C C H H H H H H H H H H H H H H H H H H H H H H H H H H H
charge: -0.322409 -0.358184 -0.450925 -0.078210 -0.384845 -0.383673 -0.368474 -0.373168 -0.373949 -0.381489 -0.544251 -0.456563 0.290412 -0.522506 0.193938 -0.034757 0.291140 -0.001775 -0.370451 -0.344114 -0.597750 -0.212728 -0.234943 0.195057 0.198832 0.192611 0.196391 0.191795 0.192650 0.191058 0.197087 0.239931 0.203518 0.194356 0.212524 0.235228 0.210189 0.198584 0.205438 0.256633 0.257596 0.313103 0.211741 0.367226 0.236325 0.245453 0.221716 0.223092 0.214087 0.217454
chargesum: 0.00000
title: Mulliken charges with hydrogens summed into heavy atoms:
elementType: O N N N C C C C C C C C C C C C C C C C C C C
charge: -0.322409 -0.045082 -0.083699 -0.078210 0.009043 0.005329 0.015970 0.014977 0.069500 0.025392 -0.098833 -0.052541 0.290412 -0.008277 0.193938 0.176983 0.291140 -0.001775 -0.134126 -0.098661 -0.166209 0.008988 -0.011851
polarizability: 3.16761633e+02 9.53905104e+00 2.23018523e+02 -1.78189350e+01 1.12255636e+01 1.56225832e+02
1716.lowfreq: -12.0920 -3.2150 -0.0012 -0.0004 0.0012 1.7040 6.7059 15.2292 17.0696
frequency: 4.4659 15.0933 16.5679 26.9950 41.6977 57.1202 60.2599 71.3050 81.6260 101.7550 110.6511 113.9417 122.2788 142.7222 146.9936 153.9165 193.1866 211.6801 243.8297 259.0770 275.8384 306.9077 321.8555 362.7253 397.9701 427.6904 443.0450 460.8797 465.9196 481.6314 531.0908 543.7655 583.9144 603.9556 614.1844 636.6374 657.0869 691.7430 719.0699 726.5471 743.4873 751.8232 764.1154 772.6450 786.3219 813.4559 822.4955 842.4408 858.1739 861.1769 881.2115 911.0325 921.1923 937.5951 940.8222 970.7697 975.1386 979.5727 986.6080 992.8868 1002.8422 1006.6612 1008.9539 1022.2504 1042.3846 1047.0451 1065.5080 1077.5344 1080.1100 1088.4220 1107.7019 1112.2581 1157.7984 1174.2023 1196.0806 1202.5530 1208.3539 1218.0116 1232.4746 1240.9836 1244.3113 1253.8643 1267.2273 1270.1813 1275.2255 1281.3519 1289.6350 1292.7171 1295.4425 1299.0899 1311.4654 1315.6242 1335.1868 1347.4434 1351.5444 1356.3564 1357.0380 1386.1260 1410.0165 1424.1894 1435.0503 1442.9829 1446.4472 1457.0467 1460.4565 1462.1523 1465.2794 1472.9978 1475.6379 1480.5284 1481.6914 1487.4045 1524.8484 1587.6032 1594.9200 1635.4448 1657.4858 2949.5593 2950.9157 2952.0240 2953.4541 2961.3120 2967.4716 2973.7709 2982.8523 2985.7669 2992.6024 3004.3563 3010.2008 3015.1604 3026.4565 3032.1406 3044.3168 3061.0097 3069.7586 3088.9145 3109.4894 3128.8106 3142.8290 3157.2659 3169.8842 3192.5927 3430.6202 3559.4439
redmass: 4.0716 2.1902 4.8364 3.9885 3.7577 2.1649 3.6343 4.3624 2.8034 2.6004 2.4531 3.8207 4.3367 2.3340 2.1190 3.2507 3.9318 3.9668 3.9514 4.8867 2.8198 4.3651 2.9518 3.6225 2.8692 2.8130 3.2286 2.9305 3.0424 3.4026 1.5133 2.9493 3.7706 3.2882 6.5027 1.5450 5.3014 4.1470 1.0619 1.0925 1.2233 1.4207 3.1283 3.7169 1.3216 2.0986 1.6589 1.3790 1.7424 2.2816 5.3399 1.4191 1.8260 1.3839 1.3412 5.9238 1.3024 1.7019 3.7634 2.1162 1.2325 2.4738 2.1674 3.7748 1.5764 3.2669 2.3126 2.3200 2.1120 4.0490 1.5844 1.5765 1.1536 1.9220 1.5862 2.0532 1.3757 1.5590 1.5472 1.3336 1.3520 1.5414 1.9696 1.2962 1.2277 1.0745 1.1829 1.1780 1.1122 1.1742 2.0491 1.3980 1.4507 1.4251 1.3901 1.5956 1.6525 3.2196 2.7668 1.1797 1.1547 3.5138 1.1319 1.0918 1.0714 1.0742 1.0776 1.0971 3.4466 2.0627 1.1157 1.1008 4.3806 6.5561 5.8577 7.3045 4.7587 1.0590 1.0604 1.0605 1.0593 1.0598 1.0606 1.0597 1.0726 1.0882 1.0953 1.0985 1.0653 1.0997 1.0997 1.1038 1.1035 1.1034 1.0796 1.0739 1.0975 1.0852 1.0900 1.0959 1.0995 1.1145 1.0848 1.0787
irintensity: 0.2206 0.0471 0.3422 0.0980 0.6017 0.8875 0.9364 3.2630 2.5352 5.3280 4.1291 3.2209 5.1960 0.8467 1.1567 0.7775 0.3428 6.5761 1.6703 5.2138 4.7913 14.6974 8.7072 0.9056 4.0922 10.5199 4.1623 0.2704 13.7397 3.0875 58.4999 45.6121 1.0060 1.3867 0.5623 17.1230 0.6614 12.7548 14.1157 0.6061 4.2021 68.7896 14.4446 0.1410 2.9784 76.8088 68.8859 8.9530 2.0149 8.2130 3.1171 2.1219 6.7085 5.6958 79.0464 3.1394 0.0029 1.5224 2.1769 0.9069 12.5475 1.0571 9.6927 4.3756 8.6132 4.5883 1.1089 2.0862 0.4041 3.5575 6.5432 1.6608 1.0200 10.7962 14.3120 24.2825 16.9104 15.5101 61.6190 4.2300 26.4549 37.4812 25.5923 0.0745 25.6532 2.3519 5.5426 2.1561 0.0100 0.0158 36.1550 22.5876 23.8392 25.0761 10.4521 0.4350 0.0671 35.3233 5.5593 3.6177 35.3069 18.2461 8.3646 3.6923 0.2086 0.2397 0.4724 4.3581 6.8826 183.0775 7.1398 31.2597 91.8617 59.2156 47.8529 15.9396 21.8871 1.4418 16.2650 5.2293 1.7606 26.6338 134.3388 4.9432 33.7455 22.4343 4.6494 5.3152 20.7967 4.5183 12.8904 4.6163 128.0099 84.9442 48.7287 7.5245 3.6648 1.1781 11.2816 25.2545 25.1006 33.3639 349.5349 24.6356
temp: 298.150 k
press: 1.00000 atm
elementType: 8 7 7 7 6 6 6 6 6 6 6 6 6 6 6 6 6 6 6 6 6 6 6 1 1 1 1 1 1 1 1 1 1 1 1 1 1 1 1 1 1 1 1 1 1 1 1 1 1 1
symmnumber: 1
zpe: 1118973.2 jmol-1
zpe.correction: 0.426194 hartree
zpe.thermalcorrener: 0.450292 hartree
zpe.thermalcorrenthalpy: 0.451236 hartree
zpe.thermalcorrgfe: 0.365769 hartree
zpe.sumelectzpe: -977.979023 hartree
zpe.sumelectthermal: -977.954925 hartree
zpe.sumelectthermalent: -977.953981 hartree
zpe.sumelectthermalfe: -978.039449 hartree
dipole: -3.2963 -1.4212 -1.0867
dipole: 3.7505
quadrupole: -169.6374 -128.2055 -141.8892
quadrupole: 8.2733 1.1088 3.4758
quadrupole: -23.0600 18.3719 4.6882 8.2733 1.1088 3.4758
hfenergy: -978.4052176 hartree
pointgroup: C01 [X(C19H27N3O1)]
dipole: 1.3083676 0.2499327 0.6348339 debye
polarizability: 315.9363279|-23.084962|155.8077203|3.9090965|-5.8790761|224.26194 unknown
InChI: InChI=1S/C19H27N3O/c1-2-3-4-5-6-7-8-9-14-19(23)20-15-18-21-16-12-10-11-13-17(16)22-18/h2,10-13,20-21H,1,3-9,14-15H2
charge 0 multiplicity 1
50 atoms
O  -1.3785 -1.086223 -0.147663
N  -2.000086 -0.237357 1.917064
N  -4.126008 -0.533859 -0.410526
N  -5.484281 0.130056 1.307909
C  3.969259 -0.485736 0.2195
C  5.277785 0.332019 0.133901
C  2.734047 0.374614 0.568574
C  6.511921 -0.527922 -0.219488
C  1.428918 -0.448056 0.632691
C  7.818578 0.291535 -0.311591
C  0.197622 0.42094 0.987685
C  9.052304 -0.579266 -0.671242
C  -1.110146 -0.360141 0.869906
C  -3.288856 -0.971766 1.939154
C  -4.312394 -0.440848 0.971448
C  10.341239 0.214548 -0.70787
C  -5.251925 0.026839 -1.02204
C  -6.100893 0.434068 0.069607
C  -5.616989 0.218143 -2.371461
C  -7.349046 1.043021 -0.195307
C  11.17339 0.318159 -1.774845
C  -6.865872 0.829259 -2.612226
C  -7.718699 1.234937 -1.542328
H  4.086235 -1.286606 0.979206
H  3.794146 -0.999438 -0.748559
H  5.454074 0.845686 1.102336
H  5.160089 1.133042 -0.6255
H  2.905412 0.883614 1.540539
H  2.622665 1.178753 -0.188948
H  6.633272 -1.327531 0.541349
H  6.334339 -1.043999 -1.186117
H  1.237382 -0.937542 -0.340529
H  1.536047 -1.259831 1.379959
H  8.001619 0.803444 0.656194
H  7.705997 1.090647 -1.071348
H  0.143264 1.26685 0.272929
H  0.311351 0.857559 1.99917
H  9.139564 -1.388641 0.085371
H  8.88738 -1.073603 -1.648573
H  -3.714781 -0.904057 2.951865
H  -3.075161 -2.033149 1.712144
H  -1.791166 0.406739 2.681206
H  10.597825 0.749507 0.221372
H  -3.249335 -0.891495 -0.813818
H  -4.969581 -0.092287 -3.19803
H  -7.998904 1.351949 0.629208
H  -7.190309 0.99569 -3.64558
H  -8.680225 1.704643 -1.777112
H  12.091613 0.915221 -1.734498
H  10.957819 -0.193727 -2.721384
