program: Gaussian 09
title: 000294289
version: EM64L-G09RevD.01
frameworkgroup: C1[X(C15H22F6O2)]
method: RPBEPBE
basis: SDD
operation: Freq
keyword: #p
keyword: freq=noraman
keyword: PBEPBE/SDD
title: #p freq=noraman PBEPBE/SDD
converged: YES YES NO NO
title: Mulliken charges:
elementType: F F F F F F O O C C C C C C C C C C C C C C C H H H H H H H H H H H H H H H H H H H H H H
charge: -0.129936 -0.156666 -0.129458 -0.152415 -0.113289 -0.162162 -0.401583 -0.237357 -0.334672 -0.002944 -0.405091 -0.441840 0.250901 -0.385795 -0.523955 -0.398402 -0.414408 -0.403005 -0.403343 -0.408391 0.362739 0.371021 -0.376322 0.284926 0.242335 0.243115 0.225933 0.209524 0.189698 0.222134 0.247884 0.274679 0.211104 0.197229 0.226063 0.216662 0.205447 0.197284 0.201664 0.212445 0.186338 0.213508 0.210479 0.196884 0.381033
chargesum: 0.00000
title: Mulliken charges with hydrogens summed into heavy atoms:
elementType: F F F F F F O O C C C C C C C C C C C C C C C
charge: -0.129936 -0.156666 -0.129458 -0.152415 -0.113289 -0.162162 -0.020550 -0.237357 -0.049745 -0.002944 0.080360 -0.006383 0.250901 0.026037 -0.001393 0.009932 0.028317 -0.000273 0.010767 -0.008544 0.362739 0.371021 0.031041
polarizability: 1.93707397e+02 1.16583624e+00 1.63218913e+02 7.92339578e+00 -3.19444515e+00 1.43947851e+02
1716.lowfreq: -8.2818 -1.7502 -0.0010 -0.0008 0.0005 8.1948 30.2630 40.4884 51.3540
frequency: 30.2440 40.4137 51.2636 56.4955 66.7536 82.2102 119.1435 134.4987 139.4391 150.2372 160.9041 178.0008 181.6451 195.3326 206.4674 234.2178 250.4525 260.6148 268.1786 272.4409 277.0411 294.9056 301.5395 312.6848 319.2884 336.2209 342.9810 365.4838 411.4578 425.5380 459.3845 461.3531 477.6023 488.6704 501.2178 535.2615 555.0381 614.8031 632.6116 668.0314 700.0020 708.6850 720.6625 729.3235 760.2780 785.0032 802.2743 830.4295 849.0389 852.9799 879.7605 895.1802 933.1492 937.9419 955.0466 969.2548 984.9547 993.7858 1005.8639 1027.4777 1029.8759 1039.9950 1060.5209 1071.3962 1077.9635 1086.3680 1092.7561 1096.1814 1109.7694 1111.1661 1118.1659 1128.2550 1153.7164 1158.2543 1161.8872 1176.8312 1208.1041 1218.1111 1232.6626 1262.5698 1273.5081 1277.5530 1282.2852 1296.3713 1300.4820 1306.7850 1314.1631 1321.3156 1334.0932 1344.9310 1351.8803 1353.1816 1359.3063 1361.7431 1371.6033 1424.9279 1435.5045 1457.3345 1465.3202 1469.4999 1472.4638 1475.7119 1483.9851 1484.7701 1487.2269 1498.3379 1602.2585 2964.3400 2969.6770 2970.6651 2971.4977 2975.2299 2979.4136 2983.8229 2987.3104 2992.3909 3003.5928 3008.7101 3013.1958 3021.3873 3031.1417 3031.8474 3041.4186 3046.7004 3049.2939 3052.2434 3071.8737 3078.4966 3102.9890
redmass: 4.6335 10.3844 8.7203 6.0019 2.7751 9.0679 5.9664 3.0103 3.6272 3.2055 9.2457 3.7481 3.6251 3.8098 3.8794 3.7405 3.8742 3.0189 3.5647 4.3072 3.0954 11.0564 6.1580 5.1549 2.6705 3.5781 3.0515 3.1513 10.9691 2.3984 6.0492 9.5725 6.2535 14.3901 2.2794 2.7594 5.6977 8.2731 10.1243 6.4987 1.2177 1.2198 1.5439 1.4701 1.7362 1.7262 2.5157 2.9339 4.1924 1.9432 2.6129 2.9847 2.3241 2.2700 3.8830 2.0585 7.4788 2.2201 4.7338 2.4254 2.5175 2.1146 7.6125 3.6338 2.6864 5.3707 2.2321 2.5423 2.4674 2.7354 2.8116 1.3925 5.4772 4.8287 1.4154 1.4104 1.3501 1.3481 1.2820 1.2251 1.3276 1.1798 1.1714 1.1223 1.2251 1.2367 1.4153 1.1607 1.3924 1.3996 1.3747 1.3614 1.4335 1.3460 1.5919 1.1998 1.2373 1.0898 1.0825 1.0738 1.0818 1.0804 1.0809 1.0763 1.0813 1.0922 5.3266 1.0600 1.0680 1.0639 1.0624 1.0633 1.0624 1.0625 1.0619 1.0632 1.0741 1.0968 1.0860 1.0958 1.0988 1.0991 1.1013 1.0993 1.0976 1.0872 1.0872 1.1020 1.0691
irintensity: 0.2576 0.3654 0.2382 0.2111 0.1928 0.1703 0.7311 2.1610 0.1975 0.5687 1.8587 2.9246 1.9231 0.9210 3.1668 1.1054 1.1027 0.3920 0.3016 0.4441 1.8607 0.5011 4.7000 4.8561 6.1847 6.7670 7.8119 1.5133 1.5823 2.9825 6.2577 3.2317 1.1519 1.2350 0.2170 9.0343 3.2671 35.4524 29.1579 8.0241 17.9763 59.0122 17.1674 15.3455 12.9065 2.1325 6.3936 3.0558 37.2099 1.5225 10.0085 47.8869 28.1594 19.5185 68.0290 19.5446 28.5183 9.0226 47.4337 22.7594 19.7104 30.6426 216.9992 67.2262 3.5996 102.6564 12.8791 51.4109 3.1016 24.8472 12.0171 9.5418 311.5800 141.1627 21.1959 5.6031 6.1044 0.1683 3.3589 5.9053 1.9879 6.6645 10.7329 1.4667 21.7482 5.3160 31.6107 5.9391 4.8853 1.7713 0.9124 1.8856 4.2597 8.5969 27.8416 120.0832 68.4408 16.4266 8.3169 8.0356 2.7621 6.6233 3.0271 1.6759 4.4486 33.9198 41.7133 35.8491 9.1035 2.3944 28.3394 10.8270 52.5239 10.1581 48.6261 10.6193 3.3949 4.7590 7.2369 16.0542 88.0513 6.6895 163.1640 106.3894 12.3470 30.6864 9.8977 11.5011 379.9509
temp: 298.150 k
press: 1.00000 atm
elementType: 9 9 9 9 9 9 8 8 6 6 6 6 6 6 6 6 6 6 6 6 6 6 6 1 1 1 1 1 1 1 1 1 1 1 1 1 1 1 1 1 1 1 1 1 1
symmnumber: 1
zpe: 931469.2 jmol-1
zpe.correction: 0.354778 hartree
zpe.thermalcorrener: 0.378330 hartree
zpe.thermalcorrenthalpy: 0.379274 hartree
zpe.thermalcorrgfe: 0.302526 hartree
zpe.sumelectzpe: -1332.454713 hartree
zpe.sumelectthermal: -1332.431160 hartree
zpe.sumelectthermalent: -1332.430216 hartree
zpe.sumelectthermalfe: -1332.506965 hartree
dipole: -6.7746 0.9211 -0.8081
dipole: 6.8845
quadrupole: -145.9771 -136.8963 -141.7198
quadrupole: 0.4684 -0.0296 2.7333
quadrupole: -4.4460 4.6348 -0.1888 0.4684 -0.0296 2.7333
hfenergy: -1332.8094905 hartree
pointgroup: C01 [X(C15H22F6O2)]
dipole: -2.6631346 0.349432 -0.3491729 debye
polarizability: 193.5747343|1.4624503|163.0279453|8.2856733|-3.7087316|144.2714808 unknown
InChI: InChI=1S/C15H22F6O2/c16-14(17,18)13(23,15(19,20)21)11-9-7-5-3-1-2-4-6-8-10-12(11)22/h11,23H,1-10H2
charge 0 multiplicity 1
45 atoms
F  3.060812 2.160052 0.96918
F  2.50434 1.882453 -1.210863
F  4.369463 0.915592 -0.371252
F  2.498101 -0.833064 -2.034769
F  3.87528 -1.716441 -0.46141
F  1.708172 -2.320809 -0.518255
O  2.577033 -0.407261 1.638434
O  0.124128 -1.374802 1.928776
C  0.637737 0.226867 0.162212
C  2.185372 -0.04944 0.305825
C  0.204392 1.542461 0.907134
C  -1.3230 1.781323 1.018745
C  -0.171201 -0.945405 0.77023
C  -2.065308 2.115143 -0.301308
C  -1.333926 -1.476181 -0.034314
C  -3.604105 2.257664 -0.084922
C  -2.40919 -2.26516 0.746379
C  -4.505212 1.534067 -1.125508
C  -3.807314 -2.220894 0.068167
C  -4.282765 0.002111 -1.25736
C  3.033352 1.221077 -0.070341
C  2.594641 -1.218465 -0.673921
C  -4.460331 -0.803528 0.0601
H  0.396073 0.322229 -0.910483
H  0.654222 2.405441 0.385382
H  0.635038 1.512498 1.925278
H  -1.468589 2.628479 1.718417
H  -1.813109 0.914133 1.506118
H  -1.865505 1.33472 -1.060503
H  -1.64718 3.04932 -0.725036
H  -1.780644 -0.615697 -0.558832
H  -0.895798 -2.099657 -0.843752
H  -3.879745 3.330091 -0.078446
H  -3.858142 1.883223 0.92661
H  -2.081539 -3.314003 0.870781
H  -2.492162 -1.851307 1.770229
H  -4.354536 1.99526 -2.122937
H  -5.563793 1.724265 -0.853177
H  -3.738422 -2.609505 -0.968848
H  -4.463421 -2.924961 0.615328
H  -3.277176 -0.181191 -1.683216
H  -4.988121 -0.392479 -2.016348
H  -5.545196 -0.893095 0.265544
H  -4.043533 -0.230649 0.911694
H  1.775209 -0.842173 2.086445
