program: Gaussian 09
title: 000294271
version: EM64L-G09RevD.01
frameworkgroup: C1[X(C9H12Cl2F4O2)]
method: RPBEPBE
basis: SDD
operation: Freq
keyword: #p
keyword: freq=noraman
keyword: PBEPBE/SDD
title: #p freq=noraman PBEPBE/SDD
converged: YES YES NO NO
title: Mulliken charges:
elementType: Cl Cl F F F F O O C C C C C C C C C H H H H H H H H H H H H
charge: 0.034852 0.076895 -0.135667 -0.087358 -0.095622 -0.123828 -0.398940 -0.237172 0.150224 0.213266 -0.595042 0.268046 -0.703340 -0.687942 -0.690736 0.055414 -0.036830 0.281504 0.284649 0.225322 0.231155 0.227998 0.244134 0.216937 0.225592 0.224579 0.209896 0.238379 0.383634
chargesum: 0.00000
title: Mulliken charges with hydrogens summed into heavy atoms:
elementType: Cl Cl F F F F O O C C C C C C C C C
charge: 0.034852 0.076895 -0.135667 -0.087358 -0.095622 -0.123828 -0.015307 -0.237172 0.150224 0.213266 -0.028889 0.268046 -0.018864 -0.001279 -0.017882 0.055414 -0.036830
polarizability: 1.30763019e+02 -1.38766604e+00 1.21134424e+02 2.43707978e+00 -9.97349275e+00 1.15452566e+02
1716.lowfreq: -12.8389 -5.7406 -0.0013 0.0011 0.0017 4.5015 33.4856 35.6916 44.6497
frequency: 32.9999 35.5799 44.5290 59.3630 88.7717 118.2701 134.6078 170.3063 177.0966 192.3189 209.2574 228.0711 238.0120 251.8097 259.5253 267.4495 271.6595 298.5147 310.7854 327.0079 341.4162 357.6524 371.9871 377.3771 379.8451 392.5456 443.1373 471.1958 520.0345 554.7983 569.6015 582.8914 669.1161 718.8522 743.6600 795.9942 841.1974 841.6764 885.6798 927.3102 936.8018 952.6660 955.5870 990.0962 998.0251 1008.2594 1024.9107 1030.8752 1061.9491 1097.7807 1118.4405 1133.1788 1190.9455 1218.1797 1244.0600 1269.8047 1327.6847 1379.3337 1382.7368 1406.9062 1418.8184 1436.0301 1455.5522 1463.2119 1466.4394 1476.2640 1483.6252 1495.3375 1588.2880 2983.1896 2987.4495 2992.5214 2994.6627 3065.9056 3081.6858 3082.9602 3085.3161 3092.8356 3095.5333 3097.7337 3103.2106
redmass: 9.5005 4.4140 4.7658 9.6335 10.0799 6.1194 13.5307 1.3810 2.5099 3.4616 5.2292 2.6993 2.3790 1.2534 2.0613 14.3621 4.3715 6.4312 4.0834 3.3882 10.1996 2.2831 21.7430 4.6450 17.7086 6.3046 2.9907 10.7291 5.1067 5.3088 6.5642 4.5744 4.4723 8.1397 1.2330 3.9499 4.5891 4.0527 3.3204 1.8268 1.5843 1.2240 6.3075 2.4463 3.6938 1.8397 3.9010 3.2524 2.6856 4.3239 5.1901 7.5917 2.7057 2.8809 1.5924 2.0033 1.7903 1.1692 1.1877 1.2027 1.0984 1.3605 1.0498 1.0475 1.0491 1.0517 1.0516 1.0742 5.5768 1.0351 1.0348 1.0665 1.0361 1.0691 1.1007 1.1001 1.0994 1.0996 1.0962 1.0968 1.0995
irintensity: 0.0965 0.2193 0.2559 0.1492 0.4232 3.0324 0.2678 0.2745 1.0767 0.1590 0.8423 1.0227 1.4985 0.1423 0.1563 0.4921 1.5539 2.7094 2.3270 0.9145 2.9373 0.7008 1.4184 18.2453 1.0117 6.2511 1.1183 19.4893 17.4482 17.7174 8.8370 6.1588 38.0912 109.8005 59.3520 56.0659 71.3759 46.2831 70.2583 7.7597 2.6807 4.1972 228.8182 9.7862 59.1081 6.4893 39.4156 58.8160 40.4977 231.1178 148.2720 71.7615 5.1020 1.6987 19.7722 0.2588 57.7007 19.1804 26.2136 5.1045 13.1614 216.6930 1.7374 1.7004 0.9724 18.9152 16.0364 41.0274 55.6169 21.0772 16.0492 5.7595 24.6137 491.7196 12.2712 3.3178 70.2116 31.3675 4.9130 14.5946 26.9644
temp: 298.150 k
press: 1.00000 atm
elementType: 17 17 9 9 9 9 8 8 6 6 6 6 6 6 6 6 6 1 1 1 1 1 1 1 1 1 1 1 1
symmnumber: 1
zpe: 527413.8 jmol-1
zpe.correction: 0.200881 hartree
zpe.thermalcorrener: 0.220179 hartree
zpe.thermalcorrenthalpy: 0.221123 hartree
zpe.thermalcorrgfe: 0.152950 hartree
zpe.sumelectzpe: -1818.731812 hartree
zpe.sumelectthermal: -1818.712514 hartree
zpe.sumelectthermalent: -1818.711570 hartree
zpe.sumelectthermalfe: -1818.779743 hartree
dipole: -5.2620 -1.1737 -3.1648
dipole: 6.2516
quadrupole: -111.7993 -114.3559 -118.8149
quadrupole: 0.5452 3.3726 0.5187
quadrupole: 3.1907 0.6342 -3.8249 0.5452 3.3726 0.5187
hfenergy: -1818.9326932 hartree
pointgroup: C01 [X(C9H12Cl2F4O2)]
dipole: 2.1438809 0.9060796 -0.7951329 debye
polarizability: 130.5563956|-1.459307|109.9863117|-2.3198925|6.3010298|126.8073018 unknown
InChI: InChI=1S/C9H12Cl2F4O2/c1-6(2,3)5(16)4-7(17,8(10,12)13)9(11,14)15/h17H,4H2,1-3H3
charge 0 multiplicity 1
29 atoms
Cl -1.277693 -1.078779 -2.34786
Cl -2.190589 2.443193 1.306239
F  -0.000536 -2.07622 -0.24425
F  -2.252194 -2.03249 -0.061537
F  -3.428549 0.41529 0.117495
F  -2.075105 1.645342 -1.217641
O  -1.072228 -0.294487 1.722493
O  1.543284 -0.353387 1.717821
C  2.93146 0.25623 -0.207318
C  -0.992238 0.064991 0.33515
C  0.339933 0.769486 -0.068545
C  1.605886 0.164104 0.560085
C  3.157435 1.723794 -0.681191
C  2.838421 -0.689058 -1.449003
C  4.098593 -0.192503 0.703249
C  -1.158984 -1.279275 -0.485622
C  -2.182596 1.053348 0.071353
H  0.419176 0.832551 -1.164256
H  0.287211 1.811757 0.307565
H  2.362193 2.079985 -1.359886
H  4.112569 1.77678 -1.233438
H  3.224295 2.418205 0.176231
H  2.676117 -1.736457 -1.141789
H  2.025997 -0.40334 -2.14035
H  3.792005 -0.632901 -2.003998
H  4.180417 0.450904 1.596564
H  5.04833 -0.135733 0.141687
H  3.956404 -1.228555 1.053097
H  -0.119414 -0.442472 2.050655
