program: Gaussian 09
title: 000294270
version: EM64L-G09RevD.01
frameworkgroup: C1[X(C17H13N3O2)]
method: RPBEPBE
basis: SDD
operation: Freq
keyword: #p
keyword: freq=noraman
keyword: PBEPBE/SDD
title: #p freq=noraman PBEPBE/SDD
converged: YES YES NO NO
title: Mulliken charges:
elementType: O O N N N C C C C C C C C C C C C C C C C C H H H H H H H H H H H H H
charge: -0.324445 -0.213310 -0.472865 -0.046001 0.073028 0.166872 0.432979 0.342712 -0.334450 -0.467445 -0.422984 -0.383782 -0.231475 -0.272666 -0.242156 0.248910 0.129057 -0.269559 -0.177913 -0.289870 -0.165342 -0.353364 0.191775 0.239706 0.295737 0.240411 0.229581 0.230353 0.231652 0.333610 0.281540 0.244823 0.274742 0.235018 0.245123
chargesum: 0.00000
title: Mulliken charges with hydrogens summed into heavy atoms:
elementType: O O N N N C C C C C C C C C C C C C C C C C
charge: -0.324445 -0.213310 -0.139255 -0.046001 0.073028 0.166872 0.432979 0.342712 -0.142675 -0.227739 -0.182573 -0.088045 -0.001895 -0.042314 -0.010504 0.248910 0.129057 0.011981 0.066909 -0.015128 0.069676 -0.108241
polarizability: 4.18690084e+02 3.38500624e+00 2.39864132e+02 4.74900369e-02 1.45944074e-01 8.04229009e+01
1716.lowfreq: -3.8848 -2.1352 -0.0008 0.0007 0.0009 1.8870 16.3414 23.4510 35.0129
frequency: 16.2627 23.1943 34.9815 48.9428 64.3453 97.4515 112.7843 150.0411 172.6468 177.3131 180.9501 214.6405 271.1920 279.3309 288.1507 371.4761 407.1397 417.4445 424.0703 458.0719 471.2677 508.4643 516.7957 517.1692 556.5510 600.1579 615.9830 627.2988 642.6315 645.0461 690.2944 694.1133 739.4509 748.1127 758.0536 781.8345 782.8861 789.9850 807.9205 853.6827 862.4248 869.0775 910.3343 910.3942 923.6470 924.6971 952.0065 960.6767 960.8690 970.4781 985.6176 992.8176 1010.3205 1021.2202 1036.7413 1047.1634 1086.3953 1089.8764 1131.6941 1156.7261 1165.0302 1183.5535 1197.0963 1223.5305 1236.6247 1271.4831 1285.6213 1288.3608 1318.8406 1328.7159 1367.7631 1409.0400 1413.2119 1419.8538 1444.2051 1452.7978 1455.4058 1491.6853 1539.4607 1556.5741 1559.7500 1580.1238 1591.1260 1599.5294 1636.0641 1724.0048 3103.5843 3109.9113 3126.4372 3131.5405 3134.2708 3144.1669 3146.3879 3155.7892 3164.7151 3165.2193 3176.7967 3190.2150 3558.2757
redmass: 4.9287 5.7715 6.1218 7.2765 4.9405 5.8557 4.4173 5.7072 4.2700 4.0614 7.0072 7.0764 3.8916 10.0003 4.6130 8.2984 3.6221 2.9429 4.5753 7.0211 3.3564 7.0487 7.1931 2.9187 2.3792 7.4443 7.2333 1.6263 7.2851 3.4357 5.4525 7.2882 1.2959 2.0474 7.1215 5.5698 2.0455 1.7950 1.4171 5.0996 4.9414 1.8734 1.3236 7.2038 1.3656 6.1519 1.4018 1.4237 6.9417 1.4966 1.3329 1.3629 1.3450 4.3274 2.3050 2.4492 1.6816 2.2472 2.3205 1.4297 1.0791 1.1066 1.2898 1.6401 1.8875 1.6426 1.6230 2.4021 2.9583 4.0229 2.2149 2.8599 1.9392 5.4242 2.4475 2.4032 2.3110 2.4363 2.7494 6.3874 6.0325 5.9085 7.4288 5.2078 6.0791 9.5301 1.0917 1.0867 1.0874 1.0870 1.0880 1.0937 1.0902 1.0965 1.1003 1.0951 1.1014 1.0945 1.0749
irintensity: 1.2242 0.4441 1.2571 5.2536 0.4670 8.4958 0.0094 0.0805 7.2636 4.6163 3.6101 0.6766 4.3966 5.5150 2.5496 8.2186 5.4012 11.8912 0.3948 0.3791 0.1980 0.8082 0.1695 16.2086 0.0079 2.3285 8.3203 31.8306 11.9199 3.7072 42.9975 13.9604 26.0233 27.6565 10.2503 16.5788 71.6413 40.6117 73.1813 182.6198 1.6344 18.4720 8.5284 409.1243 5.3014 461.7200 1.7342 15.3090 23.2070 18.1139 1.5577 3.8847 0.7856 150.6130 4.9597 97.1794 20.8069 17.5324 297.6111 11.2329 0.6588 3.3919 2.7451 7.8537 3.9303 16.8819 1.0711 28.5450 9.0392 3.4702 61.6583 46.6682 15.3600 109.1116 2.6901 38.7104 1.0343 501.8920 471.1451 7.6998 5.3203 12.6214 32.9268 7.2787 7.3412 242.3762 7.5935 21.6432 0.8689 1.6012 13.9005 30.9590 11.9569 32.6165 29.1764 16.2665 18.4302 3.5251 35.4101
temp: 298.150 k
press: 1.00000 atm
elementType: 8 8 7 7 7 6 6 6 6 6 6 6 6 6 6 6 6 6 6 6 6 6 1 1 1 1 1 1 1 1 1 1 1 1 1
symmnumber: 1
zpe: 690293.5 jmol-1
zpe.correction: 0.262919 hartree
zpe.thermalcorrener: 0.281030 hartree
zpe.thermalcorrenthalpy: 0.281974 hartree
zpe.thermalcorrgfe: 0.213550 hartree
zpe.sumelectzpe: -968.766675 hartree
zpe.sumelectthermal: -968.748564 hartree
zpe.sumelectthermalent: -968.747620 hartree
zpe.sumelectthermalfe: -968.816044 hartree
dipole: -0.7467 1.4857 -0.0019
dipole: 1.6628
quadrupole: -80.0573 -120.2085 -133.9020
quadrupole: 7.5881 0.0698 0.0133
quadrupole: 31.3320 -8.8192 -22.5127 7.5881 0.0698 0.0133
hfenergy: -969.0295941 hartree
pointgroup: C01 [X(C17H13N3O2)]
dipole: 0.2699924 0.4902678 -0.3386578 debye
polarizability: 418.6722247|2.9685083|188.1241539|-2.4256896|-74.6616573|132.1807383 unknown
InChI: InChI=1S/C17H13N3O2/c21-17(22-19-12-14-8-3-4-11-18-14)20-16-10-5-7-13-6-1-2-9-15(13)16/h1-12,20H
charge 0 multiplicity 1
35 atoms
O  1.081886 0.364938 -0.182249
O  0.372339 -1.51061 1.134833
N  -1.116922 0.006799 0.07084
N  5.501374 1.537501 -0.984173
N  2.456962 -0.047934 0.10929
C  -3.55804 0.249851 -0.079889
C  -4.879574 -0.237795 0.265407
C  -2.406764 -0.479917 0.417551
C  -3.46371 1.428476 -0.894507
C  -5.019404 -1.409849 1.078249
C  -6.033091 0.466578 -0.215697
C  -2.576704 -1.624599 1.211893
C  -3.887145 -2.08176 1.537397
C  -4.606381 2.092958 -1.348119
C  -5.90679 1.608769 -1.006749
C  0.109529 -0.517687 0.437977
C  4.736164 0.598384 -0.33414
C  5.298547 -0.472751 0.414193
C  6.700987 -0.575541 0.492527
C  3.281299 0.792011 -0.474888
C  7.500401 0.385937 -0.172756
C  6.856129 1.418049 -0.894253
H  -2.490962 1.844338 -1.184611
H  -6.024786 -1.765181 1.330357
H  -1.700095 -2.161542 1.579065
H  -7.025379 0.085584 0.053548
H  -3.990633 -2.977509 2.158948
H  -4.505696 2.990198 -1.968145
H  -6.796164 2.136446 -1.367197
H  -1.062425 0.83991 -0.516165
H  4.635084 -1.187972 0.909065
H  7.165538 -1.388298 1.060437
H  2.956798 1.653069 -1.07639
H  8.593245 0.340056 -0.135451
H  7.43728 2.181989 -1.4230
