program: Gaussian 09
title: 000294269
version: EM64L-G09RevD.01
frameworkgroup: C1[X(C14H13N3O3)]
method: RPBEPBE
basis: SDD
operation: Freq
keyword: #p
keyword: freq=noraman
keyword: PBEPBE/SDD
title: #p freq=noraman PBEPBE/SDD
converged: YES YES NO NO
title: Mulliken charges:
elementType: O O O N N N C C C C C C C C C C C C C C H H H H H H H H H H H H H
charge: -0.319795 -0.315497 -0.223572 -0.451033 -0.046106 0.070732 0.306345 0.187109 -0.325302 -0.321214 -0.232233 -0.248439 0.244961 0.128285 -0.527494 -0.270702 -0.178878 -0.290986 -0.166723 -0.354144 0.297044 0.240460 0.228697 0.226328 0.364776 0.227035 0.227045 0.244984 0.282021 0.243872 0.234000 0.274449 0.243975
chargesum: 0.00000
title: Mulliken charges with hydrogens summed into heavy atoms:
elementType: O O O N N N C C C C C C C C C C C C C C
charge: -0.319795 -0.315497 -0.223572 -0.086257 -0.046106 0.070732 0.306345 0.187109 -0.028259 -0.080754 -0.003536 -0.022110 0.244961 0.128285 0.171570 0.011319 0.064994 -0.016537 0.067277 -0.110169
polarizability: 3.68412277e+02 -1.09550081e+01 1.94077982e+02 -9.62530820e-03 -1.11125450e-01 7.59392299e+01
1716.lowfreq: -2.8867 -0.0008 0.0004 0.0007 2.3405 10.0750 18.7249 29.1849 36.2315
frequency: 18.6309 29.1486 36.1764 66.9778 74.8152 96.6894 98.3861 130.6768 173.5849 180.9053 188.7309 195.3141 242.5278 255.2908 287.3624 305.6237 309.5179 371.3695 407.4739 454.4061 460.7112 481.7310 517.7051 554.0938 558.0907 593.0538 609.0651 640.0974 676.7961 714.8134 724.2766 746.7965 748.3223 755.8672 756.1470 789.8428 825.6090 852.3522 860.3009 910.0360 912.4528 928.6130 935.0265 959.4971 961.0682 969.4379 979.7223 995.9232 1010.3484 1036.3254 1042.4250 1085.6370 1104.0751 1117.0800 1134.5962 1153.6261 1164.5901 1175.3086 1201.6815 1223.0554 1257.1612 1285.3863 1307.1564 1318.2769 1328.1410 1395.5068 1412.6209 1428.6192 1451.4989 1452.3669 1466.0790 1467.4736 1482.4536 1517.2044 1555.9503 1559.2901 1580.0377 1605.8354 1613.6940 1719.0761 2967.8650 3058.3464 3103.3233 3128.5370 3133.0538 3137.4124 3145.8228 3153.5492 3164.5232 3168.8904 3176.2741 3188.9520 3508.1143
redmass: 4.8699 5.7610 5.7558 6.8741 4.4798 5.3557 3.7083 6.2475 4.2377 6.6972 2.6149 5.2751 1.4331 5.9826 4.6457 5.0263 3.7130 8.7630 3.6244 3.2692 7.0310 6.1138 2.9161 5.2187 3.8446 7.1068 7.5284 7.1557 6.8494 7.5584 2.2417 1.6307 2.0035 1.2752 6.0785 1.8068 6.3900 1.3877 4.7330 1.3012 7.9992 7.2537 1.3510 1.4253 6.9666 1.4949 1.2973 8.6329 1.3432 2.3059 2.0739 1.6675 2.4568 1.2570 2.6132 1.4412 1.0797 1.0678 2.3027 1.6339 1.9264 1.6234 1.7117 3.0429 3.9379 6.2818 1.9296 1.5064 1.8474 2.3789 1.4977 1.0505 1.2609 2.8096 6.6437 6.0675 5.8863 6.0000 6.5178 10.6643 1.0324 1.1044 1.0916 1.1001 1.0881 1.0857 1.0901 1.0912 1.0951 1.0976 1.1014 1.0959 1.0759
irintensity: 2.9999 0.1655 2.4629 1.3116 0.4156 7.1191 8.4013 0.0602 8.5077 3.4099 3.3333 1.8528 1.6574 3.5541 1.2791 2.6391 1.9449 7.6950 5.7331 9.3771 2.1389 0.3292 15.4355 8.2614 1.1257 0.7193 7.8731 7.5487 0.9330 22.1850 10.7513 7.8864 24.7459 199.0492 15.2727 41.6699 49.4182 1.2266 59.6787 0.0257 342.2870 698.8283 7.0035 16.3115 32.6895 17.3409 2.3656 49.9903 0.8198 4.9190 11.6065 19.2349 126.7759 0.1640 314.4056 17.8854 0.6921 1.8056 64.1190 6.5085 78.3574 0.3388 35.0713 8.1655 3.3296 64.1108 14.7754 108.7205 91.2050 24.2740 159.3121 14.7417 73.3193 655.3381 6.3157 11.4818 13.2648 19.6673 106.6225 229.7760 69.8136 43.1394 7.3986 18.3131 14.6481 0.4902 12.2457 19.8338 17.2841 21.2188 18.6144 5.9100 82.1845
temp: 298.150 k
press: 1.00000 atm
elementType: 8 8 8 7 7 7 6 6 6 6 6 6 6 6 6 6 6 6 6 6 1 1 1 1 1 1 1 1 1 1 1 1 1
symmnumber: 1
zpe: 652134.0 jmol-1
zpe.correction: 0.248385 hartree
zpe.thermalcorrener: 0.266418 hartree
zpe.thermalcorrenthalpy: 0.267362 hartree
zpe.thermalcorrgfe: 0.199654 hartree
zpe.sumelectzpe: -929.737387 hartree
zpe.sumelectthermal: -929.719354 hartree
zpe.sumelectthermalent: -929.718410 hartree
zpe.sumelectthermalfe: -929.786118 hartree
dipole: 0.9600 2.5315 -0.0018
dipole: 2.7074
quadrupole: -65.6628 -107.3901 -120.9655
quadrupole: 17.7936 -0.0084 0.0189
quadrupole: 32.3434 -9.3840 -22.9594 17.7936 -0.0084 0.0189
hfenergy: -929.985772 hartree
pointgroup: C01 [X(C14H13N3O3)]
dipole: -0.3868201 0.7902244 -0.6004454 debye
polarizability: 368.1960465|9.9986896|151.0008212|-7.5952537|-57.0059939|119.2326207 unknown
InChI: InChI=1S/C14H13N3O3/c1-19-13-8-3-2-7-12(13)17-14(18)20-16-10-11-6-4-5-9-15-11/h2-10,17H,1H3
charge 0 multiplicity 1
33 atoms
O  -3.570485 1.620344 -1.176971
O  0.579509 0.431716 -0.277527
O  -0.298886 -1.345488 1.076107
N  -1.647636 0.205243 -0.104162
N  5.096628 1.296982 -0.918647
N  1.911288 -0.051041 0.090479
C  -2.963302 -0.210652 0.217792
C  -4.018052 0.558487 -0.363928
C  -3.282037 -1.305358 1.05287
C  -5.365781 0.237949 -0.112885
C  -4.63739 -1.624279 1.302062
C  -5.674161 -0.861083 0.725848
C  -0.470801 -0.366416 0.330346
C  4.243447 0.434963 -0.271159
C  -4.580738 2.461752 -1.819437
C  4.701858 -0.639689 0.540773
C  6.089618 -0.828375 0.687715
C  2.811508 0.713779 -0.485146
C  6.978857 0.053407 0.025882
C  6.435509 1.095007 -0.761648
H  -2.472745 -1.890547 1.494804
H  -6.172542 0.827691 -0.558019
H  -4.876071 -2.473805 1.950146
H  -6.721749 -1.11224 0.922217
H  -1.581781 1.018868 -0.724137
H  -5.210993 2.971153 -1.065602
H  -5.218512 1.866298 -2.500307
H  -4.014552 3.207319 -2.396517
H  3.971458 -1.29099 1.029571
H  6.47459 -1.646232 1.305684
H  8.063676 -0.060487 0.11555
H  2.567569 1.568657 -1.131786
H  7.087899 1.799069 -1.290568
