program: Gaussian 09
title: 000294294
version: EM64L-G09RevD.01
frameworkgroup: C1[X(C18H19N3OS)]
method: RPBEPBE
basis: SDD
operation: Freq
keyword: #p
keyword: freq=noraman
keyword: PBEPBE/SDD
title: #p freq=noraman PBEPBE/SDD
converged: YES YES NO NO
title: Mulliken charges:
elementType: S O N N N C C C C C C C C C C C C C C C C C C H H H H H H H H H H H H H H H H H H H
charge: 0.214674 -0.301759 -0.277928 -0.349419 -0.167890 -0.472037 -0.385813 0.483578 0.483970 -0.395501 -0.349448 -0.356176 -0.311199 -0.322231 -0.269232 -0.269164 0.249157 -0.243721 -0.248061 -0.257295 -0.257247 -0.302153 -0.457761 0.203993 0.309510 0.240376 0.221242 0.258103 0.214180 0.241182 0.246671 0.320866 0.245045 0.246309 0.224255 0.225778 0.228870 0.230061 0.224244 0.228607 0.229299 0.224065
chargesum: 0.00000
title: Mulliken charges with hydrogens summed into heavy atoms:
elementType: S O N N N C C C C C C C C C C C C C C C C C C
charge: 0.214674 -0.301759 -0.277928 -0.028553 -0.167890 0.041466 0.075805 0.483578 0.483970 0.076782 -0.349448 -0.356176 -0.070017 -0.075560 -0.024187 -0.022855 0.249157 -0.019466 -0.022283 -0.028425 -0.027186 0.150697 -0.004396
polarizability: 2.61334461e+02 5.08995182e+01 2.67050557e+02 -3.14620594e+01 1.03628149e+01 1.71128632e+02
1716.lowfreq: -9.7040 -2.6776 -0.0007 -0.0005 0.0007 5.8600 15.1062 24.4011 29.2346
frequency: 14.5549 24.2093 29.1174 57.1517 61.1621 77.7220 84.7082 110.0066 123.3712 152.5261 161.6373 186.6479 227.1854 244.1920 252.0980 318.9327 323.2814 338.6771 367.8870 397.3533 400.2249 417.7082 422.4445 440.4185 447.2475 493.5444 512.4311 526.9535 534.7790 573.5105 606.9577 646.0463 658.0770 659.7702 673.5425 715.8632 717.9337 720.8139 734.2822 748.5237 753.3938 815.5240 827.3555 842.1952 847.9218 850.3820 864.2080 901.0208 915.7761 927.6374 928.5359 938.7865 953.3313 969.3324 969.5473 993.6546 1021.3233 1026.5737 1036.7960 1044.0855 1053.8646 1077.2593 1085.3973 1099.7224 1110.7238 1123.8342 1142.3160 1158.8183 1171.3844 1174.5142 1196.5654 1206.8258 1223.7007 1232.5507 1250.5202 1255.9476 1278.6306 1296.3792 1304.0904 1318.0066 1325.5237 1339.8599 1361.9354 1370.8758 1382.8965 1394.7833 1428.6093 1430.8389 1451.8607 1459.4121 1465.8917 1477.7399 1478.0442 1490.5677 1501.1854 1508.0883 1567.0394 1581.7290 1584.1381 1610.7322 1682.7859 2948.9679 2993.4209 2994.5367 3000.0886 3022.8262 3045.0102 3050.8168 3061.0436 3070.5610 3099.7506 3130.2810 3130.8884 3141.0376 3141.5187 3157.1595 3161.6732 3169.6499 3174.6399 3597.4275
redmass: 4.8144 5.1875 4.5627 5.5287 3.4000 4.7002 2.9291 3.5862 4.1913 4.0209 3.8607 3.4468 4.8381 3.9780 4.5708 4.0088 4.3277 6.4714 3.2255 1.2703 3.4292 4.9379 4.1307 3.2282 2.8061 3.2131 3.9327 4.0141 4.8908 3.9644 5.7717 10.0187 5.7521 5.0843 6.2500 3.9679 4.3020 3.8448 4.6734 1.2813 1.3723 3.2441 1.3048 1.8599 1.3845 1.8592 4.1404 2.8689 3.6858 1.3785 1.3978 3.0192 3.4728 1.3122 1.3101 3.6377 6.9761 4.9334 2.8753 2.0629 3.0588 2.9718 1.5982 2.9736 2.3435 1.6794 1.5353 1.1037 1.0624 1.0770 1.1828 1.3391 1.5297 2.1690 1.5624 1.7063 1.6454 1.2119 1.2691 1.3337 2.1087 1.3350 1.3137 5.7925 8.9186 1.3291 2.2536 2.3298 1.0911 2.5282 1.1315 2.3103 1.1778 1.0963 1.6022 1.0936 6.0549 6.7909 6.6170 6.9459 8.6249 1.0667 1.0610 1.0631 1.0610 1.0628 1.1020 1.0985 1.1012 1.0990 1.1098 1.0850 1.0851 1.0900 1.0908 1.0934 1.0956 1.1002 1.0975 1.0775
irintensity: 0.0142 0.7935 0.5266 1.2264 1.5498 1.0384 0.3880 1.4011 2.4354 2.9118 0.3409 2.7686 0.8959 3.8092 0.7042 2.8005 3.2078 0.7376 24.0359 82.7984 10.6996 2.1704 1.4705 1.7466 27.1699 11.3173 4.1787 0.3707 6.8061 2.2011 3.1117 12.5546 4.6455 1.6425 5.6176 0.2759 6.4603 13.7448 3.8966 27.6574 165.2928 6.4102 2.8785 25.8320 0.8504 7.6281 15.8419 55.7870 43.4066 1.4991 2.4113 23.5162 13.5987 0.1333 0.1656 83.6928 26.0008 2.8928 7.6733 14.2528 0.9280 16.2278 0.8389 4.6003 8.0367 24.0614 12.7447 1.3276 1.6754 0.8976 16.4021 20.3340 34.2051 143.6543 33.7102 11.8651 0.4110 2.2806 1.9082 21.4061 137.6228 3.1454 10.9108 6.3243 5.5323 5.6115 5.7361 19.3545 26.7689 276.1089 20.0849 23.4062 2.9524 3.5752 124.4054 11.5047 0.8843 2.4791 33.4168 29.2361 332.5782 57.5450 57.3064 16.8284 26.5878 65.3000 31.7026 69.4790 6.0689 22.6138 37.2392 2.4912 1.4579 9.0907 11.4743 24.5704 30.9539 24.7971 11.9133 55.8390
temp: 298.150 k
press: 1.00000 atm
elementType: 16 8 7 7 7 6 6 6 6 6 6 6 6 6 6 6 6 6 6 6 6 6 6 1 1 1 1 1 1 1 1 1 1 1 1 1 1 1 1 1 1 1
symmnumber: 1
zpe: 881514.8 jmol-1
zpe.correction: 0.335751 hartree
zpe.thermalcorrener: 0.356177 hartree
zpe.thermalcorrenthalpy: 0.357121 hartree
zpe.thermalcorrgfe: 0.283981 hartree
zpe.sumelectzpe: -1333.177656 hartree
zpe.sumelectthermal: -1333.157230 hartree
zpe.sumelectthermalent: -1333.156286 hartree
zpe.sumelectthermalfe: -1333.229426 hartree
dipole: 2.8408 -1.4214 -0.9673
dipole: 3.3206
quadrupole: -129.3997 -130.0017 -140.3905
quadrupole: 7.1641 -5.6636 0.1633
quadrupole: 3.8643 3.2623 -7.1266 7.1641 -5.6636 0.1633
hfenergy: -1333.5134069 hartree
pointgroup: C01 [X(C18H19N3O1S1)]
dipole: 0.8717423 -0.7555921 -0.6130956 debye
polarizability: 293.1675194|47.6040646|219.8553713|-14.4674936|33.6112826|186.4907599 unknown
InChI: InChI=1S/C18H19N3OS/c1-3-8-16-14(6-1)21(15-7-2-4-9-17(15)23-16)12-5-10-19-18-20-11-13-22-18/h1-4,6-9,19H,5,10-13H2
charge 0 multiplicity 1
42 atoms
S  -2.207743 1.154481 2.235984
O  4.322262 -2.834645 0.286765
N  -0.89239 0.181316 -0.351921
N  2.006272 -2.882011 0.571449
N  3.081919 -1.012399 -0.52471
C  -0.048799 -0.691432 -1.207089
C  -0.076059 -2.162674 -0.723169
C  -0.370946 1.42979 0.118003
C  -2.301156 -0.053493 -0.303277
C  0.632301 -2.348317 0.649835
C  -0.919177 2.047108 1.277144
C  -3.073724 0.397555 0.80439
C  0.685938 2.103418 -0.553086
C  -2.98248 -0.734621 -1.350187
C  -0.447017 3.290024 1.74165
C  -4.468007 0.206075 0.854204
C  3.070399 -2.176814 0.081706
C  1.187419 3.329244 -0.065543
C  -4.374397 -0.961327 -1.283705
C  0.62402 3.933483 1.080228
C  -5.127387 -0.489738 -0.185947
C  5.333732 -1.945729 -0.366155
C  4.516061 -0.670501 -0.776734
H  -0.350081 -0.627503 -2.27398
H  0.997932 -0.354673 -1.128846
H  -1.120783 -2.516262 -0.64868
H  0.426175 -2.795341 -1.47913
H  0.639491 -1.377898 1.182905
H  0.062888 -3.056307 1.276995
H  1.122883 1.669111 -1.456042
H  -2.424854 -1.083601 -2.223952
H  2.21354 -3.799833 0.960844
H  -0.906673 3.741846 2.627177
H  -5.031045 0.585945 1.713468
H  2.01259 3.817777 -0.595445
H  -4.869434 -1.497978 -2.100681
H  1.004973 4.88954 1.453608
H  -6.208109 -0.656992 -0.135482
H  5.750378 -2.491913 -1.230047
H  6.125111 -1.747932 0.374211
H  4.8015 0.211792 -0.173666
H  4.664679 -0.417068 -1.841593
