program: Gaussian 09
title: 000294265
version: EM64L-G09RevD.01
frameworkgroup: C1[X(C15H14ClN3O)]
method: RPBEPBE
basis: SDD
operation: Freq
keyword: #p
keyword: freq=noraman
keyword: PBEPBE/SDD
title: #p freq=noraman PBEPBE/SDD
converged: YES YES NO NO
title: Mulliken charges:
elementType: Cl O N N N C C C C C C C C C C C C C C C H H H H H H H H H H H H H H
charge: -0.082190 -0.258339 -0.253415 -0.438689 -0.384736 0.183168 0.182412 0.270420 0.268863 -0.391868 -0.391426 -0.352112 -0.356628 -0.252130 -0.252303 -0.220577 -0.218779 0.319885 -0.334795 -0.547799 0.233017 0.233079 0.241405 0.241343 0.304640 0.223020 0.223117 0.222667 0.222757 0.298087 0.246135 0.269588 0.282331 0.269851
chargesum: 0.00000
title: Mulliken charges with hydrogens summed into heavy atoms:
elementType: Cl O N N N C C C C C C C C C C C C C C C
charge: -0.082190 -0.258339 -0.253415 -0.134050 -0.086650 0.183168 0.182412 0.270420 0.268863 -0.158851 -0.158346 -0.110706 -0.115285 -0.029110 -0.029187 0.002090 0.003978 0.319885 0.180928 0.004383
polarizability: 2.38437037e+02 -1.16059328e+01 2.49080133e+02 1.97708415e+01 3.55666598e+00 1.12562691e+02
1716.lowfreq: -1.7559 -0.0020 0.0003 0.0007 4.5058 7.2492 11.5467 25.8619 34.7725
frequency: 11.4620 25.7347 34.7566 49.1008 66.8302 103.4955 107.8894 148.3894 173.4454 193.5868 233.3344 269.1907 274.3981 288.4524 334.1189 354.3253 368.1520 422.8112 425.5305 450.0984 456.8366 521.8839 535.7144 557.9802 578.3441 591.0437 610.3882 627.4751 631.7696 696.4644 708.7571 727.1755 730.7712 750.3254 756.3808 779.0509 785.0330 854.1690 856.6432 861.5221 902.4987 936.7105 938.3570 942.0397 973.9233 975.5420 985.0156 989.6980 1012.3873 1022.8723 1032.3070 1071.1497 1114.4316 1118.1429 1154.7891 1163.3000 1169.2953 1176.4603 1204.7757 1233.3573 1238.2289 1241.2266 1300.5124 1311.6116 1313.5639 1370.2981 1387.1271 1404.5434 1406.4028 1438.8002 1441.2497 1443.9431 1444.3056 1460.9628 1475.6962 1486.2404 1492.0391 1588.1404 1594.4972 1617.4944 1636.6746 1660.1078 3000.7010 3058.0095 3067.8158 3127.6455 3128.4491 3137.4128 3139.0454 3152.2146 3153.0668 3154.6112 3165.9513 3166.8736 3486.1911 3540.2268
redmass: 8.2128 5.4356 5.3803 8.4471 7.8585 3.7217 4.2111 3.5874 5.7159 5.4793 5.3529 2.3326 4.2049 4.7075 1.4758 4.8050 3.6109 3.7631 4.2030 2.8866 2.4797 5.4829 1.4017 4.0501 3.5027 4.4193 7.1638 6.7409 5.6471 4.6112 7.7326 3.7017 3.6652 1.5018 1.4900 2.5050 4.8003 2.2530 1.3691 1.5836 6.9964 1.3831 1.4111 2.7302 1.3162 1.3040 2.5872 6.7688 2.1517 1.7941 1.8784 3.1777 1.5053 2.4704 1.4617 1.1546 1.0782 1.7572 1.6880 2.3414 1.7121 1.5821 1.1765 1.8341 1.8270 1.3112 2.6051 8.4931 4.7745 1.2431 1.3251 1.5596 2.7478 1.7543 3.3085 3.2117 2.0766 7.3678 6.7588 7.8573 7.9759 6.6368 1.0596 1.0856 1.0733 1.0849 1.0850 1.0895 1.0897 1.0948 1.0949 1.1120 1.1002 1.1002 1.0780 1.0770
irintensity: 0.5631 0.3682 0.3571 3.1760 13.3471 3.7096 4.9111 0.0393 1.6812 0.8337 5.4296 1.3498 0.4038 0.5812 17.6628 5.6955 26.3892 8.5711 5.0167 0.7679 13.2096 0.3633 191.3429 3.2430 1.1317 31.3201 3.5040 7.2411 6.2334 14.5950 6.5895 16.8874 14.8506 0.3137 167.6131 0.1064 3.6805 9.2778 0.3183 0.4585 0.0137 3.0191 0.3717 8.5427 0.0499 0.0305 15.0028 7.3585 3.5392 9.2950 11.9156 0.8975 4.4250 11.7862 1.9764 15.0858 0.1737 13.3847 161.5061 49.0133 134.7599 79.9239 48.7789 4.4031 32.0070 2.7038 2.6594 4.8165 30.0968 34.0398 42.3921 13.8238 16.1465 20.2140 26.8218 26.1837 440.1168 3.3884 0.1534 21.7414 15.5889 147.7780 45.3390 6.3840 17.2736 0.1886 0.0873 11.8831 2.0821 6.9504 52.3032 13.5922 52.9091 6.4399 27.2191 27.1887
temp: 298.150 k
press: 1.00000 atm
elementType: 17 8 7 7 7 6 6 6 6 6 6 6 6 6 6 6 6 6 6 6 1 1 1 1 1 1 1 1 1 1 1 1 1 1
symmnumber: 1
zpe: 689657.7 jmol-1
zpe.correction: 0.262677 hartree
zpe.thermalcorrener: 0.280249 hartree
zpe.thermalcorrenthalpy: 0.281193 hartree
zpe.thermalcorrgfe: 0.213806 hartree
zpe.sumelectzpe: -1278.135661 hartree
zpe.sumelectthermal: -1278.118089 hartree
zpe.sumelectthermalent: -1278.117145 hartree
zpe.sumelectthermalfe: -1278.184531 hartree
dipole: -1.8196 -0.6376 -1.8329
dipole: 2.6603
quadrupole: -114.6222 -114.0314 -127.3296
quadrupole: 4.6406 -2.9939 3.3569
quadrupole: 4.0389 4.6296 -8.6685 4.6406 -2.9939 3.3569
hfenergy: -1278.3983376 hartree
pointgroup: C01 [X(C15H14Cl1N3O1)]
dipole: 0.6773482 -0.2617459 0.753765 debye
polarizability: 236.7683824|12.0142492|248.6491317|25.4085552|-3.672541|114.6623474 unknown
InChI: InChI=1S/C15H14ClN3O/c16-9-10-17-15(20)18-19-13-7-3-1-5-11(13)12-6-2-4-8-14(12)19/h1-8,17-18H,9-10H2
charge 0 multiplicity 1
34 atoms
Cl 6.187358 0.295829 1.076565
O  1.735114 -0.706613 -1.402375
N  -0.261377 -0.102966 0.493567
N  1.051262 -0.376838 0.82807
N  3.286675 -0.890852 0.347372
C  -2.48593 -0.380025 -0.043235
C  -2.174864 1.048032 -0.078194
C  -1.276882 -1.070593 0.302767
C  -0.784811 1.189009 0.248373
C  -3.662025 -1.130549 -0.274618
C  -2.93517 2.207712 -0.355467
C  -1.209719 -2.470482 0.420466
C  -0.142036 2.43887 0.304621
C  -3.611139 -2.536545 -0.15745
C  -2.304276 3.469585 -0.301824
C  -2.3981 -3.197149 0.184531
C  -0.923591 3.581835 0.023391
C  2.013536 -0.661187 -0.174001
C  4.415094 -1.182461 -0.53799
C  5.416465 -0.030177 -0.632717
H  -4.599379 -0.630834 -0.543018
H  -3.997958 2.130626 -0.610306
H  -0.271717 -2.977607 0.666998
H  0.922733 2.521489 0.544159
H  1.278713 -0.432329 1.824803
H  -4.514093 -3.13042 -0.335634
H  -2.880945 4.375879 -0.515909
H  -2.383405 -4.290144 0.260668
H  -0.456232 4.572511 0.052609
H  3.497593 -0.720022 1.332665
H  4.932732 -2.102968 -0.209891
H  3.991241 -1.362522 -1.544236
H  4.941557 0.917977 -0.922234
H  6.265577 -0.27097 -1.289325
