program: Gaussian 09
title: 000294230
version: EM64L-G09RevD.01
frameworkgroup: C1[X(C14H11N3O4)]
method: RPBEPBE
basis: SDD
operation: Freq
keyword: #p
keyword: freq=noraman
keyword: PBEPBE/SDD
title: #p freq=noraman PBEPBE/SDD
converged: YES YES NO NO
title: Mulliken charges:
elementType: O O O O N N N C C C C C C C C C C C C C C H H H H H H H H H H H
charge: -0.264017 -0.264728 -0.334600 -0.209927 -0.475094 -0.000904 0.113517 0.238844 0.151778 0.555860 -0.473802 -0.304220 -0.464851 -0.202443 0.255623 0.158731 -0.293691 -0.176883 -0.295106 -0.166179 -0.353388 0.320278 0.251637 0.225940 0.237762 0.237769 0.329103 0.232313 0.244046 0.241112 0.236480 0.249041
chargesum: 0.00000
title: Mulliken charges with hydrogens summed into heavy atoms:
elementType: O O O O N N N C C C C C C C C C C C C C C
charge: -0.264017 -0.264728 -0.334600 -0.209927 -0.145991 -0.000904 0.113517 0.238844 0.151778 0.555860 -0.153524 -0.052583 -0.238912 0.273088 0.255623 0.158731 -0.061378 0.067163 -0.053994 0.070301 -0.104347
polarizability: 4.03706145e+02 -1.20018149e+00 1.84389285e+02 7.96202237e-03 1.71007283e-02 7.57990669e+01
1716.lowfreq: -58.1483 -10.4656 -5.2922 -1.6452 -0.0009 -0.0005 0.0009 9.3306 20.8399
frequency: -58.1324 8.4141 20.8016 32.3581 55.7105 62.3053 105.5116 119.3362 155.6177 155.6755 179.7453 224.8293 226.7218 288.2087 300.4434 339.5700 355.2173 399.0758 423.5363 424.2973 447.4094 518.0794 537.7613 597.4364 602.0072 613.7754 631.8746 646.2619 679.9186 682.8375 711.8652 712.5824 742.3340 760.4774 784.4986 787.9552 796.2973 841.5560 855.6031 880.1380 897.4751 898.9895 911.0707 928.4423 941.3415 947.1829 965.7603 966.0267 982.4181 1000.9127 1037.9909 1058.1150 1065.7022 1092.3756 1110.5405 1119.8732 1147.9389 1167.2754 1194.6656 1216.5248 1264.5781 1282.0871 1305.1610 1311.0649 1340.2818 1364.4638 1384.0591 1405.1543 1452.8473 1456.4941 1482.6946 1490.2169 1507.9053 1537.1958 1569.4012 1579.6092 1616.8936 1636.9609 1722.6444 3012.2865 3063.8590 3089.9780 3130.4963 3134.0565 3137.3719 3154.1917 3174.0632 3185.1532 3203.1108 3543.0060
redmass: 2.3563 4.5487 7.7191 6.7375 7.6965 6.2549 6.7086 6.9276 8.0346 4.4988 7.3248 6.2697 7.5976 4.7940 9.5237 6.2573 9.9677 3.4181 3.1022 5.7779 6.3187 2.9362 7.4503 7.6076 3.7946 7.4354 1.3038 7.5187 9.8669 5.8816 4.5246 8.8719 1.6878 7.4951 6.4219 2.2185 1.4547 10.1991 6.7239 7.6550 1.3017 1.3767 1.3419 6.6477 4.7363 1.4304 6.6190 1.5029 4.5679 1.3515 2.3879 3.9350 1.4570 1.6298 2.7351 1.0362 1.5249 1.0760 1.9620 1.8027 1.3540 3.1846 2.0281 4.2621 1.9082 1.3526 4.3669 1.8744 2.3436 4.5901 1.6117 1.8706 1.9111 5.8403 5.3983 6.3959 7.3679 7.8805 10.1488 1.0533 1.0896 1.1191 1.0883 1.0904 1.0895 1.0942 1.1015 1.0953 1.0939 1.0760
irintensity: 16.5755 0.2638 3.0668 0.9296 1.2944 2.7237 4.8212 0.1160 0.5252 5.0233 1.1300 0.6728 3.5701 2.0582 7.2380 0.3787 19.5946 4.5579 9.9616 6.4226 6.6850 14.1604 2.7953 2.5761 18.1843 2.7839 41.1291 11.9842 0.2809 35.3110 0.4861 44.6032 37.9905 5.4280 34.2167 33.4974 77.4323 26.2121 1.6185 692.7161 0.0033 40.3192 2.7549 392.8611 200.3057 22.7012 45.1242 12.5251 89.6941 0.4993 2.7695 58.9214 4.3857 1.1247 285.7952 0.0034 112.2138 2.1857 287.3118 1.1882 15.0173 103.5514 6.8604 0.5055 4.4198 15.4527 53.4861 12.5999 36.6893 40.5799 188.4393 236.1877 617.0881 10.0589 34.5975 1.0028 15.7416 42.2053 223.3200 143.4751 10.3919 33.8232 18.4804 13.1509 1.3161 22.7348 25.6619 4.2409 14.3680 28.6753
temp: 298.150 k
press: 1.00000 atm
elementType: 8 8 8 8 7 7 7 6 6 6 6 6 6 6 6 6 6 6 6 6 6 1 1 1 1 1 1 1 1 1 1 1
symmnumber: 1
zpe: 603491.8 jmol-1
zpe.correction: 0.229858 hartree
zpe.thermalcorrener: 0.247136 hartree
zpe.thermalcorrenthalpy: 0.248081 hartree
zpe.thermalcorrgfe: 0.180559 hartree
zpe.sumelectzpe: -1003.679246 hartree
zpe.sumelectthermal: -1003.661967 hartree
zpe.sumelectthermalent: -1003.661023 hartree
zpe.sumelectthermalfe: -1003.728545 hartree
dipole: -2.7609 4.9972 0.0009
dipole: 5.7091
quadrupole: -65.9701 -111.2039 -123.9122
quadrupole: -11.5016 -0.0049 0.0005
quadrupole: 34.3920 -10.8418 -23.5502 -11.5016 -0.0049 0.0005
hfenergy: -1003.9091038 hartree
pointgroup: C01 [X(C14H11N3O4)]
dipole: -1.0700927 1.9748583 0.0003366 debye
polarizability: 403.6718458|-2.9936003|184.4235837|0.0081016|0.017035|75.7990669 unknown
InChI: InChI=1S/C14H11N3O4/c18-14(21-16-8-11-3-1-2-6-15-11)17-10-4-5-12-13(7-10)20-9-19-12/h1-8,17H,9H2
charge 0 multiplicity 1
32 atoms
O  5.202541 -1.928521 0.000128
O  6.652974 -0.009304 0.000593
O  -1.12742 0.763542 -0.000299
O  0.174533 -1.255065 -0.000418
N  1.110564 0.924767 -0.000317
N  -4.958591 -1.167175 -0.000468
N  -2.328884 -0.09124 -0.000397
C  4.440967 -0.735056 0.000098
C  5.291645 0.389686 0.000369
C  2.514298 0.683963 -0.000087
C  3.050192 -0.639525 -0.000136
C  4.777364 1.687244 0.000421
C  3.365065 1.821979 0.000189
C  6.626511 -1.497337 0.000299
C  0.096633 -0.016663 -0.000523
C  -4.751179 0.19191 -0.000098
C  -5.824025 1.126864 0.000268
C  -7.151833 0.648848 0.000252
C  -3.371547 0.712214 -0.000078
C  -7.372277 -0.746254 -0.000128
C  -6.244408 -1.606113 -0.000476
H  2.400827 -1.515709 -0.000346
H  5.432242 2.561581 0.000637
H  2.927941 2.827048 0.000225
H  7.111928 -1.865291 -0.920049
H  7.111814 -1.86565 0.920558
H  0.804596 1.900102 -0.000294
H  -5.615763 2.202423 0.000558
H  -7.993523 1.348948 0.000529
H  -3.252735 1.80753 0.000223
H  -8.383791 -1.163639 -0.000155
H  -6.372755 -2.694908 -0.000775
