program: Gaussian 09
title: 000294224
version: EM64L-G09RevD.01
frameworkgroup: C1[X(C9H8Cl2N2O)]
method: RPBEPBE
basis: SDD
operation: Freq
keyword: #p
keyword: freq=noraman
keyword: PBEPBE/SDD
title: #p freq=noraman PBEPBE/SDD
converged: YES YES NO NO
title: Mulliken charges:
elementType: Cl Cl O N N C C C C C C C C C H H H H H H H H
charge: -0.019866 -0.016565 -0.303429 -0.444941 -0.154091 -0.304394 -0.462697 0.231533 0.502754 -0.454064 -0.354318 -0.026372 -0.191754 -0.116809 0.233267 0.233280 0.236191 0.236184 0.336428 0.254884 0.329187 0.255592
chargesum: 0.00000
title: Mulliken charges with hydrogens summed into heavy atoms:
elementType: Cl Cl O N N C C C C C C C C C
charge: -0.019866 -0.016565 -0.303429 -0.108513 -0.154091 0.162154 0.009677 0.231533 0.502754 -0.199180 -0.025131 -0.026372 0.063838 -0.116809
polarizability: 2.28087156e+02 4.03184927e+00 1.30167079e+02 2.48460784e-04 -9.98801276e-03 5.86482721e+01
1716.lowfreq: -0.0030 -0.0029 -0.0023 3.3871 4.2972 7.2491 45.0013 56.5048 66.5897
frequency: 45.0008 56.4357 66.5315 97.4753 117.5246 176.6773 178.1213 218.8032 252.4442 266.2810 329.0882 360.4021 430.5689 438.6726 493.8651 547.3135 583.6367 640.9005 646.1658 684.5736 688.5559 707.9233 757.0213 819.5456 836.5945 856.8642 857.2924 882.4906 923.6226 959.6373 981.8586 991.8729 996.3964 1083.2974 1121.0966 1150.2729 1159.9374 1189.9954 1201.4632 1240.1386 1288.8346 1301.4379 1312.1587 1366.6294 1400.8385 1467.2211 1478.1670 1490.4441 1522.3179 1583.6237 1610.2181 1672.5406 3008.6629 3034.5458 3057.5365 3106.7220 3147.0196 3158.3301 3173.3574 3561.3514
redmass: 5.5080 3.6693 2.8107 6.3777 6.5153 5.2304 25.5617 9.8377 4.8258 10.5736 5.3596 8.2487 7.3228 3.1040 8.8362 1.3989 3.6199 6.2542 7.1249 7.6797 3.2010 7.5807 7.1164 1.1631 1.3187 7.4794 1.6154 7.1384 3.6548 7.2823 1.2956 5.9055 5.3739 1.5760 2.1853 1.3627 1.0972 3.8942 1.1011 1.4235 2.1300 1.3037 1.3330 4.2846 3.9863 2.7599 1.0941 1.0909 2.6014 4.0734 6.3717 9.2948 1.0585 1.0579 1.1077 1.1116 1.0923 1.0897 1.0974 1.0761
irintensity: 0.2597 1.1481 0.2791 0.8780 1.0418 0.9132 0.0033 0.3055 12.3987 2.2448 0.6390 7.1644 7.8702 9.2042 27.0587 78.5949 2.5481 34.7287 10.1906 2.9325 2.6326 19.0947 12.3622 0.4631 15.6861 6.4740 65.1768 65.4896 38.0737 57.5475 3.4159 128.8323 12.5870 0.0198 55.4859 0.7524 0.5990 46.6226 0.1229 8.5933 12.7647 11.5850 6.7543 87.9250 15.7225 142.9979 0.3418 2.8412 331.3661 72.8079 227.2929 527.6405 54.9079 75.2711 11.0898 36.7514 3.9513 8.5726 12.7292 50.0677
temp: 298.150 k
press: 1.00000 atm
elementType: 17 17 8 7 7 6 6 6 6 6 6 6 6 6 1 1 1 1 1 1 1 1
symmnumber: 1
zpe: 411385.7 jmol-1
zpe.correction: 0.156689 hartree
zpe.thermalcorrener: 0.169444 hartree
zpe.thermalcorrenthalpy: 0.170388 hartree
zpe.thermalcorrgfe: 0.115587 hartree
zpe.sumelectzpe: -1451.574508 hartree
zpe.sumelectthermal: -1451.561752 hartree
zpe.sumelectthermalent: -1451.560808 hartree
zpe.sumelectthermalfe: -1451.615610 hartree
dipole: -5.3965 0.6651 -0.0033
dipole: 5.4373
quadrupole: -84.7804 -91.1994 -97.0065
quadrupole: 1.0020 -0.0044 0.0092
quadrupole: 6.2150 -0.2040 -6.0111 1.0020 -0.0044 0.0092
hfenergy: -1451.7311965 hartree
pointgroup: C01 [X(C9H8Cl2N2O1)]
dipole: 2.1247118 -0.2330645 -0.086405 debye
dipolederiv: -0.4851032 -0.3034964 0.0251457 -0.3820343 -0.3658048 0.0229445 0.0268339 0.0196093 -0.043297 -0.7324112 0.2413559 0.0245467 0.3008494 -0.1781639 -0.0097606 0.0233235 -0.0072467 -0.0350424 -1.4127981 0.2712693 0.0448895 0.2093298 -0.6668674 -0.0017327 0.0452892 -0.0041107 -0.2571276 -2.2665437 -0.1020348 0.0833347 -0.0758359 -0.402103 0.0043444 0.0829872 0.0054492 -0.3315811 -0.8530109 -0.0893563 0.0225023 -0.5453358 -0.8522796 0.0313059 0.0309832 0.0127377 -0.3604979 0.5894908 -0.0326337 -0.0101391 0.2718866 0.0634551 -0.0070029 -0.0158275 0.0061564 0.3500313 0.4188906 0.1728469 -0.008943 0.1226382 0.218858 -0.004123 -0.0082393 -0.006492 0.272115 2.3788 0.0434554 -0.0937277 0.6367871 1.2232683 -0.0442517 -0.1051627 -0.0201524 0.1894142 1.6138813 -0.1926854 -0.0596015 -0.7306892 0.1413511 0.0300251 -0.0501147 0.0073525 0.1157983 -0.5794248 -0.0208278 0.0178542 -0.1874249 -0.0984307 0.0066541 0.021229 -0.0003423 -0.1683279 -0.3197094 -0.0117612 0.0063454 0.3603426 -0.0923165 -0.0169325 -0.000664 -0.0010391 -0.1753794 0.6462711 0.516919 -0.0391228 0.5476021 0.5872381 -0.0358287 -0.040141 -0.0345794 -0.0171143 0.001513 0.1556401 -0.0065658 -0.0240068 0.0488567 -0.0015721 -0.0027934 -0.0091446 -0.0751209 0.7086489 -0.5626143 -0.0219801 -0.4741911 -0.0039206 0.0184313 -0.0235788 0.0221758 -0.0870592 -0.0582131 0.0291877 0.0699959 0.0111439 0.0682824 -0.043166 0.1478565 -0.056154 -0.0670459 -0.0772645 0.0314875 -0.0703764 0.0103295 0.0716374 0.0379284 -0.1471283 0.0491777 -0.050499 -0.055505 -0.0804775 -0.0446649 -0.0431891 0.0043705 -0.0805247 -0.1259454 -0.1210198 -0.0409158 -0.0404285 -0.0685693 0.0468504 -0.0328089 0.0108596 0.081798 0.1268472 0.1252349 -0.0613901 0.1653621 -0.0281478 0.0074953 -0.0166284 0.2049928 0.0030909 0.0080503 0.0036576 0.3306358 0.0649329 0.0583754 0.003635 0.051525 -0.035276 0.0021219 0.0039226 0.0018286 0.1770047 0.2183499 -0.042667 -0.0006902 -0.0400089 0.0849402 0.003589 -0.0005333 0.0036192 0.177926 0.0742718 0.0147343 0.0032165 0.0297191 -0.0329479 0.0026614 0.0028059 0.0032818 0.1574733 unknown
polarizability: 227.6506233|5.2823032|130.2654967|-7.2422357|-1.6348898|58.9863875 unknown
InChI: InChI=1S/C9H8Cl2N2O/c10-7-2-1-6(5-8(7)11)13-9-12-3-4-14-9/h1-2,5,13H,3-4H2
charge 0 multiplicity 1
22 atoms
Cl -4.048844 -1.899187 0.234918
Cl -4.567744 1.359472 0.189487
O  3.344524 -1.173961 -0.09595
N  1.040218 -0.926544 -0.002618
N  2.503932 1.018772 -0.098861
C  4.563133 -0.30455 -0.164113
C  3.992583 1.159518 -0.162905
C  2.248861 -0.262976 -0.065748
C  -0.253353 -0.356287 0.041318
C  -1.362547 -1.240783 0.106538
C  -0.47179 1.047732 0.022233
C  -2.669348 -0.724812 0.151775
C  -1.789346 1.542655 0.068131
C  -2.893426 0.668004 0.13287
H  5.102623 -0.566527 -1.088668
H  5.182797 -0.537014 0.717034
H  4.346469 1.739229 0.70791
H  4.27247 1.711938 -1.077286
H  1.114314 -1.944891 0.013263
H  -1.217136 -2.326311 0.122363
H  0.387026 1.721404 -0.027801
H  -1.966616 2.622218 0.053509
