program: Gaussian 09
title: 000294229
version: EM64L-G09RevD.01
frameworkgroup: C1[X(C14H11N3O4)]
method: RPBEPBE
basis: SDD
operation: Freq
keyword: #p
keyword: freq=noraman
keyword: PBEPBE/SDD
title: #p freq=noraman PBEPBE/SDD
converged: YES YES NO NO
title: Mulliken charges:
elementType: O O O O N N N C C C C C C C C C C C C C C H H H H H H H H H H H
charge: -0.263547 -0.263679 -0.329066 -0.213926 -0.473671 0.059045 -0.000323 0.238841 0.152572 0.557218 -0.473503 -0.303637 -0.464723 -0.202406 0.252927 0.396298 -0.287577 -0.318981 -0.420526 -0.178391 -0.322572 0.319465 0.252668 0.226720 0.238688 0.238694 0.330820 0.238042 0.242455 0.288945 0.236216 0.246913
chargesum: 0.00000
title: Mulliken charges with hydrogens summed into heavy atoms:
elementType: O O O O N N N C C C C C C C C C C C C C C
charge: -0.263547 -0.263679 -0.329066 -0.213926 -0.142851 0.059045 -0.000323 0.238841 0.152572 0.557218 -0.154038 -0.050969 -0.238003 0.274976 0.252927 0.396298 -0.049535 -0.076526 -0.131581 0.057825 -0.075658
polarizability: 3.98599639e+02 -3.27155259e+00 1.81843274e+02 3.34118566e-03 1.76804324e-02 7.56651558e+01
1716.lowfreq: -56.8824 -10.9337 -3.8398 -0.0011 -0.0007 0.0006 0.0769 8.6299 21.2969
frequency: -56.8591 8.3836 21.2868 33.0058 58.2615 63.8582 104.7148 119.6967 157.7495 157.8462 180.6390 225.2299 228.5174 283.3586 300.9732 340.4119 356.7248 395.8724 423.7001 424.8085 448.7791 504.6263 539.0975 592.5088 601.7863 612.4981 633.2038 640.3834 680.0314 681.5462 712.1287 712.4248 715.6087 761.5520 785.4717 797.0363 811.7717 841.2627 845.7083 891.4440 898.7171 911.7420 921.1604 927.2384 943.3929 945.2030 963.0437 982.6969 988.3903 1002.4464 1028.4892 1058.8082 1065.3844 1111.5689 1117.9944 1119.9853 1149.3738 1195.7637 1199.8177 1224.7160 1265.5906 1281.5904 1305.6506 1333.4441 1336.9306 1364.5700 1384.9682 1412.5859 1454.3689 1456.3601 1482.3368 1489.7262 1509.7213 1534.1764 1574.0631 1585.3806 1616.8073 1636.7982 1724.0950 3013.5243 3057.2127 3091.6435 3129.0355 3135.1466 3138.6984 3151.2834 3170.4134 3185.6613 3203.6476 3542.1738
redmass: 2.3488 4.8520 7.7998 7.1576 7.6352 5.7825 6.7215 5.6180 5.1850 8.0650 7.1916 6.2717 7.0961 3.7451 9.4078 6.2465 9.6690 3.2581 3.1004 5.6757 6.1992 4.0943 7.2326 7.5540 3.8014 7.7674 1.3328 7.4677 9.8735 5.4189 9.1014 4.5412 1.8634 7.5404 6.4420 1.4507 1.6214 10.5291 5.9608 8.0573 1.3755 1.3425 7.8960 1.3625 4.9922 1.3728 1.6035 4.5635 1.4092 3.6846 2.9793 3.9438 1.4570 2.6283 1.6129 1.0362 1.5468 1.9622 1.3218 1.7098 1.3473 3.2448 6.0836 1.8773 1.3579 1.3454 4.4578 2.2129 2.3116 4.5442 1.6526 1.8204 1.8934 5.3426 6.3600 5.7015 7.3520 7.8541 10.2536 1.0533 1.0901 1.1191 1.0891 1.0903 1.0908 1.0931 1.0998 1.0953 1.0939 1.0760
irintensity: 16.9063 1.0988 1.8664 0.2293 3.3307 0.6560 4.4215 2.0462 2.9119 0.7395 1.3147 0.7560 3.2017 0.7872 8.2490 0.4080 14.6593 4.9331 9.9226 7.2610 5.5725 4.0579 7.7065 0.2913 18.9190 2.1770 39.3114 6.8416 0.2266 35.9051 29.3100 0.4357 42.2067 6.2175 23.6460 77.9071 28.5007 21.9295 15.3891 429.3523 40.9058 2.1194 592.0672 4.2919 230.7518 6.4184 22.9021 90.0343 3.3525 7.6242 5.1085 56.0338 4.4072 240.8389 23.4428 0.0028 116.1981 289.3368 2.4555 14.8754 14.5202 104.2629 4.4904 8.3024 1.9033 14.4641 53.0222 20.6112 14.4564 42.6142 200.8791 231.9546 568.5447 8.7522 6.8924 4.9772 15.1284 39.7547 221.9753 139.9524 14.9529 32.9235 4.8406 12.8985 15.8059 3.6797 29.9363 3.9011 13.7657 30.7195
temp: 298.150 k
press: 1.00000 atm
elementType: 8 8 8 8 7 7 7 6 6 6 6 6 6 6 6 6 6 6 6 6 6 1 1 1 1 1 1 1 1 1 1 1
symmnumber: 1
zpe: 604218.5 jmol-1
zpe.correction: 0.230135 hartree
zpe.thermalcorrener: 0.247399 hartree
zpe.thermalcorrenthalpy: 0.248343 hartree
zpe.thermalcorrgfe: 0.180925 hartree
zpe.sumelectzpe: -1003.683753 hartree
zpe.sumelectthermal: -1003.666488 hartree
zpe.sumelectthermalent: -1003.665544 hartree
zpe.sumelectthermalfe: -1003.732963 hartree
dipole: -0.1544 5.9626 0.0012
dipole: 5.9646
quadrupole: -88.7689 -115.7747 -123.7953
quadrupole: -23.0207 -0.0077 -0.0003
quadrupole: 20.6774 -6.3284 -14.3490 -23.0207 -0.0077 -0.0003
hfenergy: -1003.9138873 hartree
pointgroup: C01 [X(C14H11N3O4)]
dipole: -0.0272661 2.3464904 0.0004548 debye
polarizability: 398.4622344|-6.3614143|181.980679|0.003593|0.017631|75.6651558 unknown
InChI: InChI=1S/C14H11N3O4/c18-14(21-16-8-10-2-1-5-15-7-10)17-11-3-4-12-13(6-11)20-9-19-12/h1-8,17H,9H2
charge 0 multiplicity 1
32 atoms
O  5.1386 -1.974236 0.000102
O  6.639441 -0.094323 0.00067
O  -1.119843 0.884195 -0.000273
O  0.128507 -1.166805 -0.000492
N  1.124133 0.987177 -0.000315
N  -2.32884 0.055402 -0.00033
N  -6.226031 -1.66746 -0.000288
C  4.409489 -0.76125 0.000103
C  5.289795 0.34065 0.000434
C  2.521915 0.708954 -0.000065
C  3.021787 -0.628355 -0.000155
C  4.810405 1.651435 0.000525
C  3.402099 1.823981 0.00027
C  6.573865 -1.581337 0.000325
C  0.087865 0.073873 -0.000574
C  -4.733199 0.282171 0.00007
C  -5.857457 1.15047 0.000444
C  -3.377651 0.850102 0.000062
C  -4.979045 -1.124353 -0.000283
C  -7.155459 0.598542 0.000447
C  -7.293099 -0.80813 0.000072
H  2.350042 -1.487422 -0.00041
H  5.488346 2.507964 0.000786
H  2.992211 2.840449 0.000337
H  7.04918 -1.961874 -0.920068
H  7.049006 -1.962289 0.920632
H  0.844625 1.970525 -0.00026
H  -5.713886 2.237632 0.000725
H  -3.274355 1.947746 0.000391
H  -4.1377 -1.825452 -0.000567
H  -8.0423 1.239397 0.000732
H  -8.282748 -1.27848 0.000053
