program: Gaussian 09
title: 000294206
version: EM64L-G09RevD.01
frameworkgroup: C1[X(C9H15NO4)]
method: RPBEPBE
basis: SDD
operation: Freq
keyword: #p
keyword: freq=noraman
keyword: PBEPBE/SDD
title: #p freq=noraman PBEPBE/SDD
converged: YES YES NO NO
title: Mulliken charges:
elementType: O O O O N C C C C C C C C C H H H H H H H H H H H H H H H
charge: -0.243807 -0.294945 -0.263119 -0.253367 -0.149600 -0.366901 -0.374071 -0.300834 -0.290152 0.260453 -0.529366 -0.506012 0.244265 -0.505028 0.265672 0.226514 0.230976 0.237554 0.224565 0.202831 0.195289 0.223501 0.236557 0.267790 0.255738 0.288409 0.235057 0.241709 0.240322
chargesum: 0.00000
title: Mulliken charges with hydrogens summed into heavy atoms:
elementType: O O O O N C C C C C C C C C
charge: -0.243807 -0.294945 -0.263119 -0.253367 -0.149600 0.125284 0.094459 0.126562 0.128638 0.260453 -0.025019 0.038135 0.244265 0.212059
polarizability: 1.54624358e+02 3.35276513e+00 1.11076054e+02 -5.20398673e-01 -2.34459537e+00 8.39308328e+01
1716.lowfreq: -8.7533 -0.0010 -0.0009 -0.0008 3.3690 13.8870 27.7559 30.9848 45.3920
frequency: 27.6354 30.6961 45.2524 65.3194 91.5650 98.7244 139.5779 160.6663 187.1377 215.1779 241.6212 283.1056 301.3103 349.7467 395.3591 404.6431 451.0951 500.6104 541.7421 563.2102 574.0865 609.0281 657.0156 748.5795 793.8091 813.0204 832.0454 859.9096 896.7894 940.0238 956.6528 1010.8129 1015.0583 1024.9012 1050.5216 1070.7553 1088.1526 1110.8485 1113.4994 1136.8192 1148.9335 1160.1420 1182.7007 1193.1473 1215.9191 1242.3511 1259.2711 1273.6401 1300.8867 1328.4229 1341.5544 1353.3366 1355.3601 1367.1193 1418.0854 1423.4977 1445.2643 1447.5823 1450.0382 1453.1312 1454.6735 1458.1440 1461.9306 1464.2023 1581.3462 1638.9062 2950.7081 2960.8377 2978.5444 2984.4078 2986.5100 3003.8641 3005.7033 3039.0901 3080.8936 3082.9765 3085.2171 3090.6055 3096.0611 3106.0275 3149.8024
redmass: 4.4972 4.2943 4.1412 5.2637 1.0988 4.3467 2.3492 3.0960 3.1035 4.9242 2.7404 3.0590 3.4522 5.1018 1.8700 5.1198 2.7278 3.7269 2.5207 3.4898 3.6774 2.5030 4.0796 3.9421 4.0090 1.9558 1.6892 4.2730 2.5603 3.2313 5.6576 2.3649 2.1610 2.6292 2.2252 3.5098 3.0753 2.1579 1.2749 1.9422 1.4434 1.5964 2.7573 1.0826 1.5137 1.2812 1.5932 1.1994 1.3741 1.2481 1.2258 1.3877 1.7040 1.2963 2.6126 1.2011 1.0921 1.0825 1.0869 1.0503 1.1304 1.1137 1.1093 1.0527 7.6336 8.7584 1.0681 1.0679 1.0669 1.0605 1.0648 1.0441 1.0501 1.0987 1.0953 1.0963 1.0961 1.0992 1.0942 1.1045 1.1047
irintensity: 0.2151 2.4933 0.9355 4.3049 0.4327 1.3069 1.5845 6.6587 7.2528 1.0598 13.0244 17.1492 34.2528 4.0506 0.9420 0.4460 0.9223 4.5794 9.1646 23.2239 14.5219 7.8960 3.7639 0.7582 16.4298 16.9000 1.2945 14.4396 4.3357 7.2817 50.4787 12.0839 15.7783 13.6917 39.8671 34.3876 7.1790 5.5026 0.6981 212.4216 11.5174 91.4937 0.8165 1.1740 68.5975 160.1144 34.3727 11.7475 59.5791 5.3428 7.3143 3.4241 48.0667 0.5600 104.8188 33.7247 10.7383 13.1145 35.4726 14.9746 17.9244 4.5107 16.6254 18.1953 282.8047 140.0440 46.0278 48.9091 32.3843 21.3072 67.0279 62.5033 1.6234 8.5293 8.5772 38.0556 11.1966 32.3599 15.0440 27.9541 16.8490
temp: 298.150 k
press: 1.00000 atm
elementType: 8 8 8 8 7 6 6 6 6 6 6 6 6 6 1 1 1 1 1 1 1 1 1 1 1 1 1 1 1
symmnumber: 1
zpe: 624554.5 jmol-1
zpe.correction: 0.237880 hartree
zpe.thermalcorrener: 0.252714 hartree
zpe.thermalcorrenthalpy: 0.253659 hartree
zpe.thermalcorrgfe: 0.193653 hartree
zpe.sumelectzpe: -706.489571 hartree
zpe.sumelectthermal: -706.474737 hartree
zpe.sumelectthermalent: -706.473793 hartree
zpe.sumelectthermalfe: -706.533799 hartree
dipole: 0.6811 -1.4989 1.4477
dipole: 2.1924
quadrupole: -75.3566 -90.8686 -81.2421
quadrupole: -2.9426 0.1218 -1.9623
quadrupole: 7.1325 -8.3795 1.2470 -2.9426 0.1218 -1.9623
hfenergy: -706.7274514 hartree
pointgroup: C01 [X(C9H15N1O4)]
dipole: -0.2753 0.6132364 0.5405157 debye
polarizability: 154.5973789|3.4011819|111.2335108|1.2503806|1.2203591|83.8003551 unknown
InChI: InChI=1S/C9H15NO4/c1-13-9(12)3-2-8(11)10-4-6-14-7-5-10/h2-7H2,1H3
charge 0 multiplicity 1
29 atoms
O  4.311463 0.893867 -0.301582
O  0.390697 -2.039168 -0.285156
O  -4.385392 -0.392049 0.081146
O  -3.083898 1.351629 -0.745606
N  1.779537 -0.299391 0.37543
C  2.988831 -1.142996 0.230511
C  2.071563 1.096635 0.762739
C  3.979253 -0.476467 -0.741224
C  3.091301 1.70967 -0.224183
C  0.52361 -0.835308 0.109018
C  -0.690002 0.088337 0.300602
C  -2.008327 -0.690875 0.156608
C  -3.164429 0.216856 -0.216967
C  -5.597294 0.372716 -0.303222
H  2.666667 -2.131816 -0.136309
H  3.467546 -1.261708 1.223127
H  2.505867 1.10911 1.78328
H  1.151967 1.701805 0.768985
H  4.939534 -1.016622 -0.76252
H  3.545351 -0.447225 -1.763651
H  2.629543 1.798812 -1.231952
H  3.421653 2.703923 0.119176
H  -0.645971 0.585713 1.287891
H  -0.672618 0.897238 -0.456461
H  -2.262098 -1.253086 1.070768
H  -1.88542 -1.458404 -0.632861
H  -6.438678 -0.261468 0.008651
H  -5.611047 0.54494 -1.392626
H  -5.616708 1.345532 0.216188
