program: Gaussian 09
title: 000294210
version: EM64L-G09RevD.01
frameworkgroup: C1[X(C12H12ClNO2)]
method: RPBEPBE
basis: SDD
operation: Freq
keyword: #p
keyword: freq=noraman
keyword: PBEPBE/SDD
title: #p freq=noraman PBEPBE/SDD
converged: YES YES NO NO
title: Mulliken charges:
elementType: Cl O O N C C C C C C C C C C C C H H H H H H H H H H H H
charge: -0.067526 -0.220332 -0.427895 -0.100892 0.270696 0.511508 -0.397159 0.111489 -0.322884 -0.386728 0.121806 -0.245833 -0.249384 -0.802980 -0.227215 -0.758447 0.250365 0.300355 0.257544 0.237465 0.247476 0.284166 0.243670 0.237710 0.251917 0.263223 0.241472 0.376414
chargesum: 0.00000
title: Mulliken charges with hydrogens summed into heavy atoms:
elementType: Cl O O N C C C C C C C C C C C C
charge: -0.067526 -0.220332 -0.051481 -0.100892 0.270696 0.511508 -0.146794 0.111489 -0.322884 -0.086373 0.121806 0.011711 -0.011918 -0.027669 0.010495 -0.001835
polarizability: 2.67521836e+02 9.82038837e+00 1.59714018e+02 2.98568118e+00 9.25297897e+00 8.71982450e+01
1716.lowfreq: -9.2091 -6.6138 -0.0016 -0.0009 0.0022 4.8208 26.9097 30.0515 57.6627
frequency: 26.8478 29.9766 57.6232 68.0536 90.8141 107.4749 139.0533 140.9647 157.1137 170.1022 208.4908 223.7743 280.1175 312.0381 328.9861 346.0365 378.2827 391.2016 423.4057 455.7397 495.2442 507.1191 522.6370 545.8968 583.4565 659.1075 663.7910 689.7416 710.7235 735.8874 765.0485 825.5646 869.7400 876.9099 892.7750 944.9001 960.4387 969.6476 996.7211 1010.5476 1015.8587 1038.8661 1040.5631 1049.9229 1126.0505 1173.0515 1177.4001 1220.7159 1253.7323 1298.9304 1326.4554 1357.6273 1362.1485 1381.5110 1397.1010 1425.5225 1434.6728 1451.7480 1457.8490 1465.8532 1480.0127 1558.2506 1563.9870 1599.3176 1610.9420 1619.6809 2984.3347 2994.7896 3073.8255 3078.2000 3123.5529 3123.6953 3131.2430 3140.0473 3156.8786 3172.4354 3179.7252 3567.2116
redmass: 6.6390 3.8598 5.5789 3.9112 4.3206 1.1158 3.2277 1.3468 5.7847 4.0666 5.6377 6.2053 4.5030 4.8343 3.9180 4.2812 5.3435 7.3913 1.6622 2.7373 3.6076 2.4111 3.2405 3.3023 5.8406 5.8292 3.9129 4.1414 4.0990 3.8065 1.2473 5.1643 1.4086 2.4158 1.9667 3.9001 1.4086 1.9503 1.3579 2.9733 2.3503 1.5939 2.0590 2.1090 1.8091 1.3766 1.9375 1.8180 1.5381 1.6634 2.2761 3.4294 1.3715 1.6375 1.5002 2.2954 1.0789 1.0664 2.2678 1.1246 1.0469 5.2804 5.4921 6.9063 8.1591 7.7570 1.0377 1.0385 1.0976 1.0935 1.0872 1.1014 1.0970 1.0864 1.0918 1.0953 1.0992 1.0673
irintensity: 2.7881 1.0220 0.0619 0.5212 5.4319 0.0706 1.2678 0.1317 1.0927 0.5671 1.0261 0.7047 3.4059 1.4734 0.6163 1.4307 7.7619 11.9312 69.4737 45.9766 16.5787 38.0109 6.0948 4.5290 24.2786 19.2109 7.8529 18.9771 9.4709 6.1719 82.5159 23.0643 7.4829 25.8497 29.2198 118.6910 15.5617 25.5839 4.0408 50.3383 37.2277 1.9580 13.0208 4.1587 1.6830 25.8996 43.3123 4.8676 122.7716 10.1153 3.2190 6.3606 72.1077 13.4681 42.9043 26.2279 22.2400 21.5574 34.8980 8.9192 21.4370 2.2223 8.0848 2.9269 32.5639 73.0687 1.5958 7.1282 9.9187 6.1327 8.4301 12.1323 3.3440 2.4633 11.8228 2.2637 18.4394 114.6083
temp: 298.150 k
press: 1.00000 atm
elementType: 17 8 8 7 6 6 6 6 6 6 6 6 6 6 6 6 1 1 1 1 1 1 1 1 1 1 1 1
symmnumber: 1
zpe: 551333.1 jmol-1
zpe.correction: 0.209992 hartree
zpe.thermalcorrener: 0.226567 hartree
zpe.thermalcorrenthalpy: 0.227511 hartree
zpe.thermalcorrgfe: 0.164104 hartree
zpe.sumelectzpe: -1128.506914 hartree
zpe.sumelectthermal: -1128.490339 hartree
zpe.sumelectthermalent: -1128.489395 hartree
zpe.sumelectthermalfe: -1128.552802 hartree
dipole: -0.3075 0.7469 1.2047
dipole: 1.4504
quadrupole: -81.4926 -104.4915 -101.4925
quadrupole: 6.6567 3.7304 -4.2740
quadrupole: 14.3330 -8.6660 -5.6669 6.6567 3.7304 -4.2740
hfenergy: -1128.7169061 hartree
pointgroup: C01 [X(C12H12Cl1N1O2)]
dipole: 0.053255 -0.1785184 0.5393623 debye
polarizability: 268.0078029|-5.1655094|150.2718144|5.4217913|-25.4395019|96.1544818 unknown
InChI: InChI=1S/C12H12ClNO2/c1-8(14-16)11(9(2)15)7-10-5-3-4-6-12(10)13/h3-7,16H,1-2H3
charge 0 multiplicity 1
28 atoms
Cl 1.658329 -2.766656 1.33748
O  -0.943022 2.254868 -1.134516
O  -4.914111 -0.292579 -0.386892
N  -3.595706 0.322885 -0.31332
C  -1.271317 0.0113 -0.241226
C  1.270612 -0.406706 -0.174155
C  -0.151195 -0.788261 -0.217867
C  -2.623102 -0.584369 -0.306231
C  2.2225 -1.247139 0.474295
C  1.798803 0.751295 -0.826453
C  -1.221504 1.536452 -0.138624
C  3.59884 -0.968711 0.514587
C  3.176134 1.047708 -0.800161
C  -2.833677 -2.080522 -0.375455
C  4.080965 0.194516 -0.12794
C  -1.462793 2.120095 1.242938
H  -0.321166 -1.87161 -0.187744
H  1.115774 1.394291 -1.38688
H  4.279489 -1.645915 1.038077
H  3.543767 1.939842 -1.317641
H  -2.340345 -2.501539 -1.270029
H  -3.906846 -2.314051 -0.423155
H  -2.401317 -2.578423 0.511638
H  5.152347 0.419624 -0.107297
H  -1.479181 3.219987 1.192446
H  -2.414704 1.745561 1.656563
H  -0.653137 1.794438 1.925008
H  -5.513039 0.497317 -0.414745
