program: Gaussian 09
title: 000294275
version: EM64L-G09RevD.01
frameworkgroup: C1[X(C17H32N2O3)]
method: RPBEPBE
basis: SDD
operation: Freq
keyword: #p
keyword: freq=noraman
keyword: PBEPBE/SDD
title: #p freq=noraman PBEPBE/SDD
converged: YES YES NO NO
title: Mulliken charges:
elementType: O O O N N C C C C C C C C C C C C C C C C C H H H H H H H H H H H H H H H H H H H H H H H H H H H H H H H H
charge: -0.241807 -0.187315 -0.243593 -0.196617 -0.485561 -0.402910 -0.392680 -0.392963 -0.373486 -0.391921 -0.383374 -0.385544 -0.353366 -0.578362 -0.370623 -0.347699 -0.370448 -0.308877 -0.304581 0.279681 0.322513 -0.693555 0.196711 0.192666 0.191467 0.204996 0.190358 0.190954 0.196960 0.188397 0.246830 0.196821 0.184016 0.212730 0.230082 0.194087 0.185285 0.182788 0.249120 0.217148 0.194190 0.183139 0.266318 0.225418 0.233735 0.197916 0.226084 0.211232 0.214873 0.224924 0.312523 0.216681 0.206434 0.238208
chargesum: 0.00000
title: Mulliken charges with hydrogens summed into heavy atoms:
elementType: O O O N N C C C C C C C C C C C C C C C C C
charge: -0.241807 -0.187315 -0.243593 -0.196617 -0.173038 -0.013533 0.003782 -0.011652 0.011871 0.051731 0.013372 0.038626 0.014707 -0.112095 0.006707 0.144037 0.061202 0.128439 0.135215 0.279681 0.322513 -0.032232
polarizability: 2.42125763e+02 -9.22769910e+00 1.85059919e+02 1.95528907e+00 3.15708422e+00 1.91513242e+02
1716.lowfreq: -8.7399 -4.5238 -0.0004 -0.0004 -0.0003 5.7015 15.3871 21.6591 26.5755
frequency: 14.5270 20.6082 26.3779 36.1287 42.5117 46.0675 54.5154 75.6834 82.6577 84.6327 98.5473 109.2829 129.9274 138.7044 180.3904 195.7316 205.9993 210.8322 219.4612 245.5799 253.7139 272.9022 283.5879 290.6919 315.9439 343.1051 349.3526 372.1225 387.3407 421.9903 444.4385 460.5795 470.7973 516.9025 552.6562 557.8942 597.2098 609.5722 656.0050 706.7148 709.1094 726.3499 746.0451 762.7961 781.8026 802.7111 815.8297 823.2994 836.2207 860.9621 870.0504 899.5059 902.3358 905.8370 929.7563 953.1001 959.3901 965.3816 993.6709 1003.0339 1009.2679 1037.4057 1049.9172 1052.1981 1056.0493 1071.8636 1073.4816 1092.2267 1096.0611 1106.5396 1110.3527 1114.4764 1123.1899 1145.2151 1156.5003 1175.0958 1183.8298 1192.7600 1198.5544 1217.7074 1220.3915 1243.5540 1248.6631 1264.4552 1268.3911 1276.7790 1279.2133 1287.3532 1290.7497 1296.3161 1311.5340 1323.1419 1332.2580 1336.7904 1342.4276 1343.9564 1344.2832 1349.5818 1353.7291 1356.9089 1360.5367 1367.6111 1367.7961 1383.8843 1396.8718 1431.0467 1445.5754 1448.6470 1449.6889 1453.2566 1456.6513 1458.4562 1461.1599 1461.7077 1464.7954 1467.6359 1472.0965 1474.8720 1481.7721 1483.5075 1489.8421 1490.8826 1626.2315 1672.1356 2939.8742 2949.9732 2953.7398 2956.8262 2958.3853 2961.6125 2962.4204 2964.8197 2967.0114 2968.5544 2973.0699 2976.4218 2976.5581 2977.5658 2988.9551 2991.1494 2994.7213 3000.4518 3008.4045 3017.1017 3019.1912 3027.1811 3043.1240 3048.4399 3060.3579 3062.3355 3069.4562 3075.8015 3083.0267 3086.3430 3093.6197 3532.1972
redmass: 3.8949 4.3752 4.4766 4.7574 3.5528 5.2698 3.0638 5.2166 3.0393 3.8350 1.7259 2.7985 3.6398 1.9529 2.4432 3.7019 2.1744 2.0554 2.1938 3.1238 1.6613 2.1163 3.0728 2.4768 2.5628 3.3947 3.5055 3.0225 1.9156 2.6060 4.0870 3.1241 2.6940 2.4243 3.0468 3.3514 1.1748 2.5181 2.5413 1.5664 3.5522 1.1533 1.5984 1.5041 1.5690 3.3506 2.0370 2.1215 1.6587 2.0855 2.2442 1.6155 2.9802 2.5005 3.0060 2.0409 2.6953 1.8019 1.5987 1.8088 2.3746 1.7703 2.2013 2.3628 2.3207 2.0734 3.4540 2.0030 2.1979 1.5912 2.1455 1.8400 2.4790 2.2639 1.4929 1.7473 2.9973 1.2914 1.1775 1.5320 1.6047 1.3187 1.3523 1.4722 1.2525 1.2022 1.2305 1.2067 1.0761 1.1813 1.2455 1.2570 1.2335 1.4776 1.3725 1.2464 1.3754 1.4311 1.4690 1.5183 1.3714 1.5046 1.4749 1.7138 1.2106 1.6151 1.0876 1.2130 1.0929 1.0883 1.0946 1.0926 1.0836 1.0735 1.0816 1.0750 1.0890 1.0791 1.0621 1.0801 1.0730 1.0790 4.8342 9.1602 1.0586 1.0590 1.0594 1.0675 1.0615 1.0610 1.0680 1.0633 1.0638 1.0596 1.0623 1.0390 1.0651 1.0653 1.0646 1.0933 1.0963 1.0977 1.0999 1.0996 1.0990 1.1019 1.1037 1.0978 1.0994 1.0955 1.0999 1.0993 1.0982 1.0947 1.0985 1.0761
irintensity: 1.1687 0.5080 0.1904 5.4121 1.9459 2.0548 0.3284 0.8524 0.4080 1.5385 0.1011 0.3081 3.1803 0.3526 0.9041 4.3133 2.7432 0.6121 1.9818 5.6487 0.6118 5.9000 12.0688 2.3730 0.1375 0.4847 0.8194 2.9016 2.3703 2.0508 4.9092 2.9746 0.1754 1.8594 20.2746 9.2463 67.8599 5.7689 1.6172 5.8502 44.8009 14.9103 1.1232 2.5998 4.7675 15.2661 4.9762 1.3438 0.4278 5.0252 1.8035 6.4856 15.7761 4.7756 2.1720 15.9381 41.7288 3.5330 6.7161 7.9456 13.2012 0.2106 25.8198 8.3610 4.7823 0.9548 47.8256 10.0622 1.2054 18.3986 7.8635 2.8495 54.3257 160.0430 1.6834 10.6455 7.3264 57.7038 5.0624 74.4594 101.8325 4.7024 0.7585 34.2259 0.5955 13.7288 6.9364 1.3130 1.4652 2.3313 4.3548 4.8719 5.4548 0.7696 1.7636 13.1325 7.1336 1.8913 3.4015 0.9913 10.0988 11.8093 1.3610 10.0041 15.5311 507.1058 27.2073 100.4003 11.9654 15.5301 20.2996 11.2253 4.8759 9.7516 3.9915 4.3395 0.9133 1.0638 4.1958 28.0962 22.2075 3.5637 126.2674 242.9886 31.9590 11.7520 24.9518 46.1056 47.2933 8.0297 9.6212 91.1402 39.9331 38.3246 36.3449 31.7129 35.2271 93.5130 41.0861 18.4408 8.0895 20.5275 64.4678 46.5589 15.4484 40.1517 174.9751 35.4560 66.0411 29.1044 55.3161 53.9337 33.3036 8.4813 35.8328 8.6913
temp: 298.150 k
press: 1.00000 atm
elementType: 8 8 8 7 7 6 6 6 6 6 6 6 6 6 6 6 6 6 6 6 6 6 1 1 1 1 1 1 1 1 1 1 1 1 1 1 1 1 1 1 1 1 1 1 1 1 1 1 1 1 1 1 1 1
symmnumber: 1
zpe: 1246612.9 jmol-1
zpe.correction: 0.474810 hartree
zpe.thermalcorrener: 0.500073 hartree
zpe.thermalcorrenthalpy: 0.501017 hartree
zpe.thermalcorrgfe: 0.416111 hartree
zpe.sumelectzpe: -1000.403313 hartree
zpe.sumelectthermal: -1000.378049 hartree
zpe.sumelectthermalent: -1000.377105 hartree
zpe.sumelectthermalfe: -1000.462012 hartree
dipole: 0.3495 -1.5205 -5.3951
dipole: 5.6162
quadrupole: -135.7004 -128.9247 -149.4668
quadrupole: -0.4816 -6.1925 9.5876
quadrupole: 2.3302 9.1060 -11.4362 -0.4816 -6.1925 9.5876
hfenergy: -1000.8781224 hartree
pointgroup: C01 [X(C17H32N2O3)]
dipole: -0.0830413 -0.7224232 2.0864779 debye
polarizability: 242.337827|8.6324444|185.344586|1.0277624|-3.7792763|191.0165109 unknown
InChI: InChI=1S/C17H32N2O3/c1-2-3-4-5-6-7-8-9-10-11-16(20)18-17(21)19-12-14-22-15-13-19/h18H,2-15H2,1H3
charge 0 multiplicity 1
54 atoms
O  4.364983 -0.253465 1.654826
O  -1.53819 -1.18894 -2.043672
O  1.37476 -1.207981 -2.156535
N  2.268746 -1.338495 -0.001996
N  -0.024432 -1.857722 -0.35832
C  -3.951077 1.452148 1.670364
C  -3.03688 2.380922 0.827955
C  -3.779532 -0.064653 1.387579
C  -1.524519 2.094523 0.971234
C  -4.00961 -0.449218 -0.092121
C  -0.647355 2.95769 0.035986
C  -3.816136 -1.951111 -0.415202
C  0.858653 2.630537 0.162578
C  -2.393269 -2.492207 -0.136412
C  1.769485 3.375068 -0.845588
C  3.646998 -1.184577 -0.526498
C  2.181815 -1.444666 1.470332
C  4.372755 -0.03816 0.193754
C  2.980928 -0.298588 2.137368
C  -1.307633 -1.774573 -0.960467
C  1.219808 -1.440396 -0.928295
C  1.548571 2.94707 -2.315148
H  -5.008352 1.734547 1.486319
H  -3.761041 1.636896 2.748168
H  -3.234129 3.433059 1.119413
H  -3.315136 2.305342 -0.242107
H  -2.763265 -0.373103 1.706014
H  -4.486827 -0.63133 2.028578
H  -1.323658 1.029047 0.737155
H  -1.216441 2.249065 2.027559
H  -3.334845 0.131987 -0.746412
H  -5.041362 -0.159348 -0.378469
H  -0.812084 4.034252 0.251306
H  -0.976244 2.789187 -1.008226
H  -4.041309 -2.111221 -1.485995
H  -4.536439 -2.560902 0.166556
H  0.997004 1.537144 0.021551
H  1.188799 2.86413 1.197782
H  -2.35482 -3.567833 -0.406395
H  -2.158785 -2.432687 0.945105
H  1.610593 4.468632 -0.745873
H  2.829916 3.191928 -0.572625
H  3.572879 -0.992254 -1.609486
H  4.205224 -2.129628 -0.365354
H  2.593729 -2.419216 1.807156
H  1.134421 -1.362362 1.809585
H  5.436022 -0.003698 -0.092799
H  3.889633 0.933531 -0.043934
H  2.477718 0.670753 1.935211
H  3.048617 -0.461612 3.225671
H  0.004713 -2.337043 0.543627
H  0.537478 3.215621 -2.670667
H  2.277312 3.438435 -2.98621
H  1.657813 1.852073 -2.432228
