program: Gaussian 09
title: 000294200
version: EM64L-G09RevD.01
frameworkgroup: C1[X(C13H10F6O2)]
method: RPBEPBE
basis: SDD
operation: Freq
keyword: #p
keyword: freq=noraman
keyword: PBEPBE/SDD
title: #p freq=noraman PBEPBE/SDD
converged: YES YES NO NO
title: Mulliken charges:
elementType: F F F F F F O O C C C C C C C C C C C C C H H H H H H H H H H
charge: -0.150691 -0.128151 -0.145884 -0.135428 -0.150845 -0.139079 -0.385093 -0.190300 0.032758 -0.591647 0.365431 0.373438 0.174576 -0.287846 -0.264281 0.467761 -0.370151 -0.377530 -0.234354 -0.236523 -0.229587 0.257494 0.292995 0.378090 0.231529 0.267313 0.232509 0.240063 0.232922 0.234638 0.235873
chargesum: 0.00000
title: Mulliken charges with hydrogens summed into heavy atoms:
elementType: F F F F F F O O C C C C C C C C C C C C C
charge: -0.150691 -0.128151 -0.145884 -0.135428 -0.150845 -0.139079 -0.007003 -0.190300 0.032758 -0.041158 0.365431 0.373438 0.174576 -0.056317 0.003033 0.467761 -0.137642 -0.137467 -0.001433 -0.001885 0.006286
polarizability: 2.64318750e+02 2.82009937e+01 1.43284495e+02 -6.16091675e+00 1.96471828e+01 9.59470518e+01
1716.lowfreq: -8.3410 -1.3566 -0.0010 -0.0008 -0.0007 3.4638 14.4576 23.7536 30.9146
frequency: 14.0706 23.5845 30.8922 47.7981 71.1773 83.0646 90.4195 113.1554 142.7285 157.9489 180.6016 201.5311 235.8457 241.3302 267.4591 278.3288 287.2333 300.9666 310.7896 342.7547 389.0661 400.7514 402.5945 449.1018 456.6490 471.1825 483.1202 487.9063 524.7911 554.0651 561.1011 611.8948 614.4583 635.1384 669.2467 691.0177 723.6940 775.4980 816.5653 847.2161 862.8467 892.5004 900.5071 926.8725 931.6061 982.0462 988.2560 995.4324 998.4345 1000.8632 1012.4034 1016.7508 1022.7025 1027.6126 1074.9632 1085.6390 1100.5963 1127.0109 1146.3458 1167.0209 1175.5428 1191.9735 1222.6224 1270.5079 1301.3117 1307.9397 1327.1839 1330.2854 1337.9544 1388.9642 1440.7140 1442.6299 1484.9478 1561.0394 1580.3602 1610.5808 1642.0286 3031.4111 3094.5941 3107.5500 3127.6519 3131.3792 3135.3031 3144.3305 3155.2826 3169.7473 3522.1046
redmass: 9.1517 4.8871 6.8825 15.7218 13.1788 7.2069 5.2405 5.8618 7.1177 11.2043 4.2939 8.7244 8.6117 8.5477 11.9156 2.8779 8.6089 12.7727 7.4211 2.8077 1.2784 10.3284 2.7527 10.0713 15.1498 2.9489 3.4475 10.4015 6.4549 6.7369 8.9433 11.3773 7.0249 6.4978 10.0885 1.8804 3.1365 2.0314 5.8076 1.3081 3.0193 2.0532 4.0734 3.3380 1.5636 1.3901 5.8831 3.3845 2.1524 2.3454 2.6293 2.1280 2.7213 2.6069 8.3045 1.6232 8.3452 3.5156 8.0064 4.2106 1.0663 1.1238 1.5779 1.4813 1.7131 1.5405 1.7303 1.3804 1.3913 6.9616 2.2304 1.1014 2.3041 8.3326 5.6017 5.9712 5.5607 1.0594 1.0897 1.1023 1.0863 1.0887 1.0896 1.0916 1.0964 1.1016 1.0659
irintensity: 0.4733 0.1798 0.2601 0.1764 0.2649 1.1018 0.1558 2.2963 0.0342 2.0925 1.1994 4.7697 0.3837 1.3442 4.9410 1.7902 7.8916 2.4944 3.7666 3.1346 160.7577 15.7502 0.1138 13.4376 10.6945 3.2665 11.1055 0.5445 4.5647 39.7723 11.9860 28.0925 6.5195 21.8677 4.2610 34.0955 42.8878 36.3945 11.3590 1.2761 44.6076 4.4869 17.6513 44.7074 5.1860 0.4426 20.8365 144.8173 13.9263 38.1556 36.8003 65.6642 63.9627 69.4292 239.3706 4.0711 210.6875 200.2381 348.1383 37.0744 1.3261 12.6122 17.6554 0.8480 24.5888 40.2228 28.6854 18.5281 60.9557 21.8894 29.3531 23.3622 19.5226 449.4315 5.5772 0.2250 167.3019 2.5554 0.8961 0.8083 3.5556 2.3761 6.9143 5.3995 34.0576 26.5450 34.3322
temp: 298.150 k
press: 1.00000 atm
elementType: 9 9 9 9 9 9 8 8 6 6 6 6 6 6 6 6 6 6 6 6 6 1 1 1 1 1 1 1 1 1 1
symmnumber: 1
zpe: 541209.1 jmol-1
zpe.correction: 0.206136 hartree
zpe.thermalcorrener: 0.226150 hartree
zpe.thermalcorrenthalpy: 0.227094 hartree
zpe.thermalcorrgfe: 0.154791 hartree
zpe.sumelectzpe: -1249.308608 hartree
zpe.sumelectthermal: -1249.288593 hartree
zpe.sumelectthermalent: -1249.287649 hartree
zpe.sumelectthermalfe: -1249.359953 hartree
dipole: -3.3799 -1.7580 -0.8050
dipole: 3.8939
quadrupole: -99.8707 -127.5270 -118.8465
quadrupole: 3.3581 3.2568 1.6078
quadrupole: 15.5441 -12.1123 -3.4318 3.3581 3.2568 1.6078
hfenergy: -1249.5147433 hartree
pointgroup: C01 [X(C13H10F6O2)]
dipole: -1.3346811 -0.7172665 -0.226063 debye
polarizability: 263.8304752|27.9455847|146.3614125|-12.3543416|14.6299033|93.3584093 unknown
InChI: InChI=1S/C13H10F6O2/c14-12(15,16)11(21,13(17,18)19)8-10(20)7-6-9-4-2-1-3-5-9/h1-7,21H,8H2
charge 0 multiplicity 1
31 atoms
F  1.279086 -1.878268 -0.126884
F  0.890702 -0.566212 1.675737
F  2.844705 -1.684594 1.510444
F  4.261921 0.832102 -1.594322
F  4.88314 -0.397958 0.192384
F  3.649404 -1.342503 -1.470591
O  2.861258 1.280276 1.020458
O  0.167193 2.653217 0.041812
C  2.513721 0.275804 0.043932
C  1.536803 0.91497 -0.974729
C  1.87889 -0.965119 0.765832
C  3.820724 -0.168327 -0.712679
C  0.209576 1.465866 -0.39469
C  -0.976142 0.582401 -0.463674
C  -2.207657 1.02592 -0.05042
C  -3.475102 0.29192 -0.059283
C  -3.590436 -1.063852 -0.490148
C  -4.65196 0.964003 0.384532
C  -4.837407 -1.715615 -0.4786
C  -5.900946 0.310956 0.395235
C  -5.998373 -1.032124 -0.037205
H  1.33194 0.176929 -1.770029
H  2.072163 1.774504 -1.410274
H  3.532687 0.930183 1.665456
H  -0.832001 -0.42869 -0.862021
H  -2.24014 2.059002 0.328247
H  -2.70226 -1.607752 -0.829538
H  -4.575682 2.005266 0.720447
H  -4.911532 -2.756842 -0.810722
H  -6.794151 0.843576 0.738621
H  -6.966925 -1.543937 -0.030028
