program: Gaussian 09
title: 000003522
version: EM64L-G09RevD.01
frameworkgroup: C1[X(C10H14N5O8P)]
method: RPBEPBE
basis: SDD
operation: Freq
keyword: #p
keyword: freq=noraman
keyword: PBEPBE/SDD
title: #p freq=noraman PBEPBE/SDD
converged: YES YES NO NO
title: Mulliken charges:
elementType: P O O O O O O O O N N N N N C C C C C C C C C C H H H H H H H H H H H H H H
charge: 1.413567 -0.255814 -0.500711 -0.493814 -0.438760 -0.638237 -0.647644 -0.639090 -0.219061 -0.212274 -0.451644 -0.033077 -0.066219 -0.624431 -0.166418 -0.114621 -0.103665 -0.025774 -0.360348 0.369512 -0.222375 -0.150713 0.011804 0.148488 0.282011 0.259056 0.277082 0.261224 0.211831 0.218251 0.399695 0.290649 0.373983 0.355944 0.415866 0.417402 0.349827 0.308499
chargesum: 0.00000
title: Mulliken charges with hydrogens summed into heavy atoms:
elementType: P O O O O O O O O N N N N N C C C C C C C C C C
charge: 1.413567 -0.255814 -0.500711 -0.094120 -0.082816 -0.222370 -0.230242 -0.639090 -0.219061 -0.212274 -0.077661 -0.033077 -0.066219 0.033895 0.115592 0.144435 0.173418 0.235450 0.069734 0.369512 0.068274 -0.150713 0.011804 0.148488
polarizability: 2.40586579e+02 7.02879209e+00 2.11620161e+02 -1.91628010e+01 1.48533542e+01 1.30170859e+02
1716.lowfreq: -8.9268 -4.4682 -0.8015 -0.0017 0.0011 0.0013 19.8980 22.8844 37.0674
frequency: 19.8667 22.8476 37.0626 42.5297 60.6062 72.6816 84.5847 116.1085 117.4433 139.3040 154.6739 159.4012 181.4333 192.8833 200.2874 209.0680 217.3133 241.4544 248.2995 276.1068 289.7204 306.9415 317.1044 327.8899 328.9426 340.7429 350.9982 360.6598 380.1789 412.5356 432.6576 459.3085 477.4024 498.0378 515.8604 535.4992 577.7816 612.9754 621.3296 644.4118 649.0972 666.5090 671.4608 691.9315 718.4583 749.6370 760.6142 766.3075 778.4304 789.8628 808.5880 819.2322 830.3393 936.9328 946.4790 968.7551 974.6272 981.8922 998.2131 1011.7075 1016.7501 1029.3598 1038.1278 1042.4432 1043.0302 1061.0987 1084.1361 1125.9340 1149.4540 1158.4887 1186.5788 1195.9913 1214.1492 1226.1796 1244.4379 1258.0928 1274.8850 1287.4708 1311.9151 1322.1159 1340.3789 1349.6790 1358.0251 1366.2701 1388.2822 1421.0759 1428.2907 1436.2361 1460.8577 1525.3897 1558.0803 1601.8829 1619.7571 1642.4222 2950.4810 2976.6868 3002.8185 3007.1466 3016.0049 3026.9305 3161.0746 3262.2886 3298.8242 3551.2016 3585.9787 3590.9041 3599.0690 3705.7661
redmass: 7.8215 6.4637 7.6793 7.1699 6.5771 5.9664 7.3522 6.7123 7.0423 3.7837 2.1926 2.1652 5.6527 2.0326 2.7033 6.7274 2.8100 4.4659 2.7845 1.1285 4.3030 2.6173 7.6341 3.9757 4.3102 6.8410 6.5956 4.9106 6.6393 6.3343 4.2002 5.9343 5.8479 5.7936 1.1333 7.5833 3.8290 5.4138 4.9025 6.0812 9.7652 9.1228 7.5971 9.8700 1.3187 4.6433 3.7089 2.9332 5.1629 1.9930 1.2553 2.9645 5.6947 7.4172 7.2559 4.4266 5.3360 2.9369 4.6461 3.3904 1.2088 3.0565 2.2444 3.9113 2.4338 3.0159 4.2634 2.1686 3.5162 2.9789 1.3867 1.9719 1.1135 1.2030 1.2172 2.7352 1.2735 1.4429 2.2952 1.4830 1.4158 2.4129 1.3710 1.3452 5.8194 4.0566 1.5492 1.4158 1.0849 6.0808 2.9893 1.4141 8.2596 3.8365 1.0558 1.0844 1.0920 1.0860 1.0974 1.0873 1.0686 1.0987 1.0836 1.0449 1.0668 1.0666 1.0667 1.1051
irintensity: 1.2574 4.5844 1.8088 1.6912 3.8471 2.1959 0.8016 0.1759 9.3917 3.3927 29.4263 96.0863 6.1713 67.6504 2.6011 18.1693 53.0719 4.4501 80.3316 110.7853 42.9018 48.2884 11.9480 36.9611 12.7649 37.5849 18.8815 43.3333 17.1452 47.0796 12.0164 21.1469 3.7208 2.8537 187.1333 3.5463 31.8663 9.1892 7.6324 5.3942 4.2216 34.6824 23.8645 22.3715 97.1766 56.0253 32.1745 125.1748 206.0872 3.7155 237.7893 26.4850 40.2171 65.2251 165.6856 34.3112 148.2557 10.6101 71.9353 114.8069 71.6676 13.4870 73.5280 148.0871 108.5338 21.6983 21.4228 17.9383 17.7666 10.4155 3.2507 68.1506 1.7234 32.2459 17.6712 3.9450 0.9254 35.5651 50.6764 55.8662 6.0601 89.7175 28.5546 57.9724 91.0961 38.9451 8.9866 35.7834 9.3317 295.5482 108.0277 48.6982 623.1587 347.5083 42.9936 7.9954 3.5467 14.5693 18.2303 35.3747 692.5414 3.9790 395.3005 83.5098 9.5240 111.8780 115.2821 43.1769
temp: 298.150 k
press: 1.00000 atm
elementType: 15 8 8 8 8 8 8 8 8 7 7 7 7 7 6 6 6 6 6 6 6 6 6 6 1 1 1 1 1 1 1 1 1 1 1 1 1 1
symmnumber: 1
zpe: 703442.8 jmol-1
zpe.correction: 0.267927 hartree
zpe.thermalcorrener: 0.292009 hartree
zpe.thermalcorrenthalpy: 0.292953 hartree
zpe.thermalcorrgfe: 0.212872 hartree
zpe.sumelectzpe: -1604.393048 hartree
zpe.sumelectthermal: -1604.368966 hartree
zpe.sumelectthermalent: -1604.368022 hartree
zpe.sumelectthermalfe: -1604.448104 hartree
dipole: 16.8280 -5.5257 -4.4050
dipole: 18.2516
quadrupole: -194.5954 -130.3460 -143.7670
quadrupole: 12.7898 17.9248 -6.9649
quadrupole: -38.3593 25.8901 12.4691 12.7898 17.9248 -6.9649
hfenergy: -1604.6609751 hartree
pointgroup: C01 [X(C10H14N5O8P1)]
dipole: 6.3376343 2.5381793 2.2259393 debye
polarizability: 239.3444645|-7.0455308|208.402117|23.2044546|20.7969533|134.631017 unknown
InChI: InChI=1S/C10H14N5O8P/c11-10-13-7-4(8(18)14-10)12-2-15(7)9-5(17)6(3(1-16)22-9)23-24(19,20)21/h2-3,5-6,9,13,16-17,19-20H,1,11H2
charge 0 multiplicity 1
38 atoms
P  3.713861 2.083714 -0.032195
O  1.022248 -2.150946 0.872649
O  3.278802 0.456794 -0.350186
O  0.558131 1.371138 1.436175
O  3.307551 -3.797361 -0.267528
O  4.432071 2.603592 -1.4812
O  5.07802 1.870439 0.952826
O  2.5218 2.979519 0.538267
O  -5.380513 -0.526865 -1.5482
N  -1.109577 -1.207783 0.260827
N  -2.192549 1.001656 0.680475
N  -2.785987 -2.189691 -0.944566
N  -4.415028 1.197746 -0.270369
N  -3.477745 2.971108 0.940582
C  2.377979 -0.227244 0.617827
C  0.90929 0.258724 0.565657
C  0.126899 -1.004288 1.032712
C  2.260083 -1.697879 0.169889
C  3.422276 -2.595174 0.560968
C  -2.142102 -0.28305 0.161084
C  -1.563282 -2.365893 -0.428651
C  -3.172074 -0.880311 -0.582191
C  -4.404852 -0.115588 -0.865042
C  -3.398738 1.688345 0.422086
H  2.784288 -0.134363 1.644177
H  0.662606 0.484702 -0.493612
H  -0.119553 -0.908653 2.107767
H  2.115248 -1.746586 -0.928035
H  3.356201 -2.826351 1.644442
H  4.370453 -2.054553 0.35268
H  1.160279 2.15322 1.209263
H  -0.947769 -3.257591 -0.495956
H  -1.356484 1.428261 1.117918
H  3.95272 -4.482251 0.037637
H  3.815841 2.9259 -2.188019
H  5.587375 2.684682 1.196393
H  -4.343913 3.472338 0.759678
H  -2.798455 3.347443 1.596372
