program: Gaussian 09
title: 000026734
version: EM64L-G09RevD.01
frameworkgroup: C1[X(C18H29NO2)]
method: RPBEPBE
basis: SDD
operation: Freq
keyword: #p
keyword: freq=noraman
keyword: PBEPBE/SDD
title: #p freq=noraman PBEPBE/SDD
converged: YES YES NO NO
title: Mulliken charges:
elementType: O O N C C C C C C C C C C C C C C C C C C H H H H H H H H H H H H H H H H H H H H H H H H H H H H H
charge: -0.282194 -0.204209 -0.104532 -0.018724 0.018515 -0.469838 -0.264920 -0.700538 -0.743503 -0.733350 -0.747666 -0.039432 -0.420423 0.073986 -0.688696 0.293483 -0.357986 -0.348717 -0.247494 -0.228203 -0.225012 0.218817 0.167497 0.235397 0.250790 0.183562 0.228468 0.209278 0.205615 0.222435 0.236386 0.212802 0.207492 0.209432 0.223717 0.214734 0.269973 0.204195 0.213468 0.181779 0.220942 0.238901 0.195247 0.252473 0.218803 0.236596 0.278286 0.232079 0.235056 0.235232
chargesum: 0.00000
title: Mulliken charges with hydrogens summed into heavy atoms:
elementType: O O N C C C C C C C C C C C C C C C C C C
charge: -0.282194 -0.204209 -0.104532 0.200094 0.186013 0.016348 0.147110 -0.063208 -0.086823 -0.085468 -0.060029 0.142347 0.039420 0.073986 -0.022173 0.293483 -0.121390 -0.070431 -0.015415 0.006853 0.010219
polarizability: 2.51560960e+02 1.47029722e+01 2.08853521e+02 -1.96087257e+01 1.33899883e+01 1.73635338e+02
1716.lowfreq: -8.0333 -3.0411 -0.0003 0.0007 0.0008 4.4334 9.3123 21.7400 29.2235
frequency: 8.2676 21.4302 29.1494 40.8200 54.0725 59.2369 71.2990 86.0903 97.0435 133.2405 148.0329 156.7582 162.4803 180.5239 195.6956 222.8876 223.2917 236.1071 259.3687 265.7694 273.8912 278.0610 316.0699 327.2073 337.4440 385.8049 399.9107 406.4755 418.9146 420.9024 434.6521 456.2579 458.6973 481.8881 514.4372 569.5321 613.6245 649.8137 672.5940 697.1983 702.6989 755.5102 773.3840 787.8038 822.6283 833.4140 858.6926 877.8701 889.5515 906.5627 921.2034 926.5730 936.3591 945.0515 947.8683 968.2975 973.6969 989.3913 990.5966 1010.5110 1017.7269 1020.0396 1028.3120 1050.5520 1060.4055 1085.1129 1096.1103 1098.9218 1113.3640 1129.4802 1131.3721 1151.1613 1173.0923 1174.1129 1181.0319 1190.5347 1215.3514 1218.2440 1238.7466 1245.2416 1276.1129 1307.5424 1311.0017 1318.9420 1324.4286 1328.8550 1332.4672 1337.0478 1343.8959 1363.5322 1368.2676 1380.4718 1381.7254 1385.1132 1385.8943 1389.5743 1393.7270 1435.0956 1458.1927 1458.9510 1462.2581 1467.8176 1469.2776 1471.6063 1474.1733 1477.8221 1478.6414 1483.3871 1486.9244 1488.0059 1491.5688 1510.2306 1566.3632 1595.1186 1611.1023 2830.6781 2907.6035 2943.9806 2970.3963 2977.6309 2979.0284 2979.7595 2982.4598 3002.3513 3005.0697 3015.5804 3031.9310 3054.7676 3062.4109 3067.8205 3072.3482 3074.4394 3075.9558 3079.2730 3083.5622 3084.7035 3085.7202 3089.5413 3102.9574 3129.2488 3138.3348 3149.5595 3158.4850 3169.4989
redmass: 3.5299 4.5330 4.7608 3.4955 3.0409 3.0510 2.7684 2.7157 3.1864 3.6556 3.0563 2.6222 2.6837 3.1863 1.7809 1.3516 1.1280 1.7276 1.8242 1.5722 1.2153 3.0543 2.7702 2.3825 4.3168 2.8857 2.7852 2.9231 2.8408 2.2262 3.1410 2.8535 2.9856 4.0258 2.8022 2.7911 6.4259 5.2458 5.3218 1.6579 2.4551 1.5531 1.7113 1.5124 3.4833 2.2289 1.2493 2.3274 2.3092 1.3048 1.2310 2.2947 1.3179 1.4371 1.4527 1.9743 4.0433 6.1948 1.3860 1.3424 3.1201 3.8545 2.0434 2.0169 2.9834 1.5860 2.0339 2.4919 2.1485 2.0512 2.1896 1.9382 1.8245 1.0725 1.9128 1.1354 2.0124 2.5444 1.8899 1.4951 1.1718 1.2016 1.2357 1.2731 1.3136 1.3693 1.4510 1.3524 1.2764 1.2291 1.2359 1.2441 1.2237 1.2302 8.5874 1.2740 1.2005 2.2674 1.0738 1.0657 1.0526 1.0491 1.0447 1.0575 1.1203 1.9785 1.0477 1.0654 1.0493 1.0525 1.0541 1.0574 7.3885 6.7032 6.5611 1.0806 1.0809 1.0601 1.0347 1.0358 1.0354 1.0374 1.0362 1.0599 1.0833 1.0989 1.0614 1.0996 1.0992 1.0995 1.0997 1.1001 1.0990 1.0984 1.1000 1.1007 1.1000 1.1005 1.0997 1.0850 1.0879 1.0921 1.0960 1.1014
irintensity: 0.0603 0.2532 1.6247 0.1984 0.5817 0.2766 0.2331 0.2523 1.7732 0.9529 0.5642 0.0668 4.1213 2.4098 0.3007 1.0278 0.5325 2.1887 1.8183 1.6600 0.3101 4.0041 0.1345 1.2849 2.6751 0.5081 0.0306 3.9540 1.3550 0.4076 2.5285 4.7039 1.7375 2.8016 2.4364 11.6448 0.1249 17.6230 11.3345 58.0161 9.0964 6.6089 31.3812 14.8955 9.3110 3.4047 0.9125 4.3156 31.7973 6.3181 4.9052 1.6920 1.3212 3.9974 0.8244 8.1142 67.5821 4.1065 0.2251 0.4597 21.8106 68.4280 4.6203 7.3241 77.6707 9.5723 5.5467 77.7956 11.1725 7.5395 31.3794 9.3427 20.4058 2.2057 27.3412 9.4089 69.8607 46.4456 62.5617 29.7986 6.2724 3.4890 4.2149 10.2251 6.4851 14.5518 8.8123 7.2393 9.0734 18.2431 19.1682 13.2835 6.7898 20.0537 2.8785 7.7179 26.9015 18.5667 9.7977 4.3019 9.4154 3.0665 8.5297 1.1965 3.1686 0.7892 3.7992 3.5965 19.4199 18.5223 17.5861 6.2117 113.7607 40.4494 8.5030 77.0841 41.9901 58.8902 32.5122 26.8393 18.5446 39.9643 31.7723 20.3197 19.3985 17.4281 34.5691 13.4566 13.7101 47.7697 9.1465 52.0047 57.8509 75.9485 73.4131 17.8311 45.5043 8.7848 30.2668 0.4201 5.2158 16.2567 21.7370 23.1254
temp: 298.150 k
press: 1.00000 atm
elementType: 8 8 7 6 6 6 6 6 6 6 6 6 6 6 6 6 6 6 6 6 6 1 1 1 1 1 1 1 1 1 1 1 1 1 1 1 1 1 1 1 1 1 1 1 1 1 1 1 1 1
symmnumber: 1
zpe: 1138376.9 jmol-1
zpe.correction: 0.433585 hartree
zpe.thermalcorrener: 0.457547 hartree
zpe.thermalcorrenthalpy: 0.458491 hartree
zpe.thermalcorrgfe: 0.377382 hartree
zpe.sumelectzpe: -906.824052 hartree
zpe.sumelectthermal: -906.800090 hartree
zpe.sumelectthermalent: -906.799146 hartree
zpe.sumelectthermalfe: -906.880255 hartree
dipole: -3.1495 0.2474 3.1252
dipole: 4.4438
quadrupole: -113.4495 -125.2817 -131.5619
quadrupole: 0.9273 -2.1275 1.9258
quadrupole: 9.9815 -1.8507 -8.1309 0.9273 -2.1275 1.9258
hfenergy: -907.257637 hartree
pointgroup: C01 [X(C18H29N1O2)]
dipole: -1.293796 0.4109745 -1.1017658 debye
polarizability: 251.5230272|-21.4572993|195.9444235|9.5841475|22.7630117|186.5823684 unknown
InChI: InChI=1S/C18H29NO2/c1-6-17(18(20)16-10-8-7-9-11-16)21-13-12-19(14(2)3)15(4)5/h7-11,14-15,17H,6,12-13H2,1-5H3
charge 0 multiplicity 1
50 atoms
O  0.11783 -1.635443 0.028282
O  -1.018564 0.332708 1.611105
N  3.539221 -0.049665 0.006387
C  4.229872 0.150808 -1.3046
C  3.28967 1.195702 0.802799
C  2.461508 -1.061705 0.053104
C  1.072133 -0.640409 -0.495557
C  3.4507 1.007225 -2.350158
C  4.677358 -1.188177 -1.931725
C  4.587817 2.02248 0.970767
C  2.717023 0.861934 2.201904
C  -1.282608 -1.306744 -0.189715
C  -2.091691 -2.566853 0.214954
C  -1.731058 -0.082827 0.652156
C  -1.786591 -3.770087 -0.699788
C  -3.038095 0.58855 0.323348
C  -3.815828 0.264606 -0.823175
C  -3.502186 1.605288 1.203424
C  -5.027025 0.942579 -1.079002
C  -4.711877 2.279361 0.948953
C  -5.478796 1.949891 -0.195124
H  5.159397 0.701012 -1.065791
H  2.541953 1.858985 0.29441
H  2.799936 -1.969444 -0.472889
H  2.295433 -1.360676 1.101661
H  1.033264 -0.645179 -1.60643
H  0.809096 0.37118 -0.129176
H  4.096794 1.230123 -3.220575
H  2.557289 0.473193 -2.722625
H  3.122002 1.971053 -1.91943
H  5.187264 -1.815358 -1.178968
H  5.383486 -0.991957 -2.759375
H  3.830389 -1.761344 -2.352769
H  4.401245 2.863965 1.662452
H  5.388526 1.389818 1.3965
H  4.949749 2.456025 0.02171
H  1.701331 0.432019 2.161945
H  2.653161 1.789657 2.799056
H  3.385103 0.155507 2.729169
H  -1.452997 -1.085802 -1.269631
H  -3.172767 -2.334661 0.199615
H  -1.822078 -2.805575 1.260838
H  -2.094806 -3.569515 -1.743965
H  -0.705171 -3.985291 -0.695797
H  -2.324999 -4.671362 -0.354954
H  -3.483517 -0.506967 -1.525671
H  -2.889684 1.844594 2.079265
H  -5.616794 0.689247 -1.96667
H  -5.059326 3.059026 1.635502
H  -6.419391 2.474706 -0.396449
