program: Gaussian 09
title: 000294154
version: EM64L-G09RevD.01
frameworkgroup: C1[X(C9H6Cl2F4O3)]
method: RPBEPBE
basis: SDD
operation: Freq
keyword: #p
keyword: freq=noraman
keyword: PBEPBE/SDD
title: #p freq=noraman PBEPBE/SDD
converged: YES YES NO NO
title: Mulliken charges:
elementType: Cl Cl F F F F O O O C C C C C C C C C H H H H H H
charge: 0.075193 0.040609 -0.122941 -0.097842 -0.134211 -0.090158 -0.405605 -0.225845 -0.258428 0.231523 -0.585261 -0.027597 0.049987 0.188763 0.246701 -0.320061 -0.238641 -0.137771 0.283662 0.301303 0.390842 0.291020 0.269233 0.275525
chargesum: 0.00000
title: Mulliken charges with hydrogens summed into heavy atoms:
elementType: Cl Cl F F F F O O O C C C C C C C C C
charge: 0.075193 0.040609 -0.122941 -0.097842 -0.134211 -0.090158 -0.014763 -0.225845 -0.258428 0.231523 -0.000296 -0.027597 0.049987 0.188763 0.246701 -0.029042 0.030592 0.137755
polarizability: 1.64024637e+02 -1.25138809e+01 1.04756232e+02 1.26866871e+01 -2.01658104e+01 1.16210790e+02
1716.lowfreq: -8.0008 -6.0706 -1.8150 -0.0013 0.0008 0.0008 20.9913 38.6576 48.0033
frequency: 20.9277 38.5695 47.9689 61.5277 86.4197 102.8494 134.3753 171.7342 179.1790 197.8726 222.4093 243.7114 266.9161 269.1780 294.1374 313.3764 328.8859 355.1697 373.9770 380.9845 391.3343 463.2213 499.2805 510.9882 542.8683 563.0861 585.0583 627.6262 656.3965 714.1685 718.2872 769.0920 801.9050 843.6895 854.5189 866.1121 871.1543 890.1618 917.8666 954.6612 992.2620 1004.0598 1018.9988 1029.1938 1034.6633 1060.1213 1090.4366 1117.7642 1127.9939 1138.6935 1203.0399 1239.5683 1279.5757 1328.8825 1377.6880 1425.6255 1438.2027 1457.4387 1546.1601 1577.4970 2998.0482 3079.8316 3102.5391 3230.7707 3245.9688 3268.1491
redmass: 9.1828 14.5072 10.5755 6.9903 8.1282 11.6900 16.1562 9.0786 7.2589 14.2839 5.4762 6.4857 13.0324 12.1358 10.2093 8.3906 8.1449 9.2661 21.7379 21.6223 8.1670 11.4268 5.9356 4.7613 8.7073 10.5742 2.9930 4.8268 4.6960 5.8679 1.2557 1.2542 6.3637 5.4984 1.4562 6.1780 5.2869 3.2756 1.4055 6.5617 4.8336 3.7481 2.2075 3.0474 4.6629 3.6724 5.5813 5.4249 7.7465 1.6983 1.9673 1.4990 1.9268 1.9107 2.9368 1.4086 1.1355 4.2444 5.4923 5.8184 1.0667 1.0694 1.0936 1.0918 1.0995 1.1093
irintensity: 0.7012 0.1550 0.1871 0.4107 0.9381 1.1369 0.2930 0.9476 2.2011 3.6535 4.6776 5.2569 0.3293 2.4628 1.7507 11.9697 11.6095 6.7465 0.7509 0.9299 3.9841 22.9033 16.3977 14.3033 10.5902 10.2836 11.0724 25.0683 44.5345 107.7250 37.6052 91.5025 90.6678 90.0430 16.2160 25.4749 0.7775 90.1725 0.7005 229.2692 48.1278 13.7275 20.9277 47.8935 88.4303 35.0226 209.1674 80.9434 154.6158 7.8881 3.3725 32.8246 29.9710 70.8604 16.3051 351.3129 95.9322 47.5348 21.6354 203.9290 7.5077 623.0775 2.2675 0.3795 3.1994 0.0853
temp: 298.150 k
press: 1.00000 atm
elementType: 17 17 9 9 9 9 8 8 8 6 6 6 6 6 6 6 6 6 1 1 1 1 1 1
symmnumber: 1
zpe: 368119.8 jmol-1
zpe.correction: 0.140209 hartree
zpe.thermalcorrener: 0.157552 hartree
zpe.thermalcorrenthalpy: 0.158496 hartree
zpe.thermalcorrgfe: 0.093112 hartree
zpe.sumelectzpe: -1890.326857 hartree
zpe.sumelectthermal: -1890.309515 hartree
zpe.sumelectthermalent: -1890.308571 hartree
zpe.sumelectthermalfe: -1890.373954 hartree
dipole: -7.5596 -0.9913 -2.8093
dipole: 8.1254
quadrupole: -96.5046 -118.6465 -118.5113
quadrupole: -0.8847 3.0998 -1.0654
quadrupole: 14.7162 -7.4257 -7.2905 -0.8847 3.0998 -1.0654
hfenergy: -1890.4670667 hartree
pointgroup: C01 [X(C9H6Cl2F4O3)]
dipole: 3.0117675 -0.1061074 -1.0665357 debye
dipolederiv: -0.2349231 0.1180956 -0.0711846 0.1030182 -0.5952939 0.1991409 -0.0713641 0.2458809 -0.1942124 -0.1391849 0.0405071 0.0386664 -0.0534581 -0.6303035 -0.2493859 0.0047677 -0.212215 -0.2890518 -0.395488 0.0817701 -0.0263527 0.0899807 -0.5246346 -0.1723325 0.0481879 -0.2569862 -0.5490259 -0.7735354 -0.2068072 0.2115438 -0.1626758 -0.3837736 0.1351358 0.0719097 0.1506269 -0.3604287 -0.724301 -0.0922265 -0.2391342 -0.0536602 -0.3930615 0.0600632 -0.2964548 0.0060451 -0.5121886 -0.5977094 0.0172389 0.2743072 -0.1237133 -0.3487978 0.074747 0.3765509 0.0367124 -0.5234468 -0.6697534 -0.0133943 0.00121 -0.1794007 -0.7014895 -0.1028405 -0.0703719 -0.0830103 -0.5788471 -0.416761 -0.1507471 -0.239171 -0.1851215 -0.1553972 -0.0940168 -0.2739884 -0.103635 -0.2767249 -1.0277978 0.0608597 0.0799423 0.3966543 -0.6306503 -0.293948 0.4782815 -0.3160141 -0.6342169 0.2902462 -0.0261491 0.0496504 0.1416591 0.3132446 0.2257852 -0.0877021 -0.1075779 0.2331002 -0.4455683 -0.0203544 -0.0805084 0.0115044 -0.0647643 -0.0265805 -0.2106739 -0.042388 -0.2045047 1.3018646 -0.0276173 -0.1225607 -0.1207534 1.5162452 -0.181885 0.0223649 -0.1646819 1.0800705 1.2710541 0.0567629 -0.1091535 0.1812144 1.3436491 0.0193197 -0.0411961 0.3790062 1.2801375 1.8770888 -0.2719731 -0.0778269 -0.5427183 0.5979664 0.3537511 -0.2549494 0.3598531 0.6256761 -1.1020885 0.4136361 0.3061235 0.2565279 -0.0084842 0.0476123 0.0144595 0.0889416 0.1118432 0.3910326 -0.2212853 -0.1715264 -0.0783863 0.020171 0.1151425 0.0226626 0.0902587 0.0084452 0.0174095 -0.0248195 0.0260681 0.1807582 -0.2803065 -0.0842698 0.2556192 -0.1080655 -0.2787318 0.0267197 0.1834331 0.2581248 0.0171655 0.0621837 0.145249 0.0402786 0.1784783 0.1576144 0.1334793 -0.0074818 -0.0060555 -0.0647452 0.0241668 0.0450856 0.0319668 0.0355712 0.076456 0.0981398 0.0262168 0.0177727 0.0120386 0.0544846 -0.0666171 0.0143621 -0.0493093 0.0991964 0.8721681 0.0176873 -0.0975181 0.1241851 0.35204 0.0224947 -0.0538566 0.0438862 0.3408418 0.1480338 0.0134585 0.0030803 0.0061467 0.1273759 -0.0658852 -0.0055027 -0.0655737 0.1080944 -0.0045147 0.025701 -0.0132998 0.0258063 0.1682231 -0.0305922 -0.0144832 -0.0305028 0.1602624 0.1043889 0.0074885 -0.0121978 0.0179736 0.1372065 -0.0751735 -0.0008683 -0.0753011 0.1196414 unknown
polarizability: 163.3875693|-18.1552382|120.1515248|-4.8530602|18.7146513|101.4525645 unknown
InChI: InChI=1S/C9H6Cl2F4O3/c10-8(12,13)7(17,9(11,14)15)4-5(16)6-2-1-3-18-6/h1-3,17H,4H2
charge 0 multiplicity 1
24 atoms
Cl -2.962599 2.066341 -1.521289
Cl -1.303265 -2.592194 -0.086601
F  -2.41694 -0.483489 -1.992347
F  -3.862735 -0.109059 -0.290367
F  -0.249686 -1.0079 1.764809
F  -2.502379 -1.177389 1.820702
O  -1.721769 1.357971 1.099041
O  2.505683 -0.496634 -1.152644
O  0.872526 1.795662 1.157669
C  -1.468537 0.320544 0.139802
C  -0.142805 0.505865 -0.661512
C  -2.671595 0.34946 -0.868874
C  -1.419919 -1.038044 0.951486
C  1.036209 0.953036 0.206879
C  2.362216 0.445006 -0.0979
C  3.616667 0.694856 0.464215
C  4.57082 -0.10653 -0.24798
C  3.861478 -0.812194 -1.216404
H  -0.316887 1.319537 -1.393999
H  0.103051 -0.400714 -1.234969
H  -0.826365 1.760606 1.36603
H  3.802661 1.37448 1.293001
H  5.642643 -0.162003 -0.07161
H  4.143827 -1.532414 -1.979938
