program: Gaussian 09
title: 000294258
version: EM64L-G09RevD.01
frameworkgroup: C1[X(C15H19F6NO4S)]
method: RPBEPBE
basis: SDD
operation: Freq
keyword: #p
keyword: freq=noraman
keyword: PBEPBE/SDD
title: #p freq=noraman PBEPBE/SDD
converged: YES YES NO NO
title: Mulliken charges:
elementType: S F F F F F F O O O O N C C C C C C C C C C C C C C C H H H H H H H H H H H H H H H H H H H
charge: 0.925382 -0.146919 -0.121374 -0.149603 -0.143121 -0.167787 -0.122011 -0.403354 -0.423965 -0.532976 -0.523935 -0.321925 0.018392 -0.507467 -0.250788 0.342281 0.390943 0.376496 -0.047948 -0.368381 -0.414632 -0.249873 -0.341750 -0.343262 -0.203752 -0.651812 -0.655120 0.282462 0.292261 0.248182 0.327351 0.265277 0.223522 0.258912 0.237590 0.242023 0.288584 0.375257 0.250288 0.356065 0.225645 0.254067 0.217390 0.259408 0.210416 0.223562
chargesum: 0.00000
title: Mulliken charges with hydrogens summed into heavy atoms:
elementType: S F F F F F F O O O O N C C C C C C C C C C C C C C C
charge: 0.925382 -0.146919 -0.121374 -0.149603 -0.143121 -0.167787 -0.122011 -0.028096 -0.067901 -0.532976 -0.523935 -0.321925 0.018392 0.067256 -0.002606 0.342281 0.390943 0.376496 -0.047948 -0.041030 -0.149355 0.038711 0.140684 0.136352 0.046536 0.045289 0.038267
polarizability: 2.53114527e+02 1.35964031e+01 2.02963800e+02 -1.47136547e+01 8.95393352e+00 1.81439794e+02
1716.lowfreq: -10.3751 -0.0009 0.0006 0.0015 3.7624 8.0501 11.5007 18.6095 25.1359
frequency: 7.6185 18.4724 25.1153 37.5457 45.7398 53.1791 59.7020 64.5257 80.1067 89.8224 105.1016 116.7168 141.7768 145.7025 155.5494 162.5391 175.6122 207.3538 209.9418 215.6449 230.3317 245.0994 247.0909 256.9833 260.2823 274.1424 274.9440 279.8120 296.7963 317.3845 320.3642 327.4719 342.2021 351.1887 363.4676 374.8764 395.7547 403.7369 410.0879 451.5583 460.0213 461.8791 466.1733 479.2785 494.1345 556.8954 571.2793 582.9158 601.4206 617.6647 640.0858 653.9564 699.0968 705.8447 738.6262 757.3263 787.1243 801.7244 812.9914 819.0801 845.6729 895.9342 901.7206 926.3035 932.9894 941.9816 966.3458 979.0406 983.5910 997.3770 1005.2473 1006.0754 1017.3865 1047.8647 1055.2660 1060.0162 1065.0787 1072.2977 1083.3302 1083.9645 1092.0352 1118.0165 1141.7405 1158.5480 1161.5428 1178.0257 1179.6531 1194.8128 1229.9712 1253.6913 1274.5402 1278.6280 1300.4232 1320.8628 1332.8200 1347.2528 1354.3748 1363.9901 1381.9904 1389.2302 1389.9805 1399.3826 1428.8643 1437.8432 1447.5368 1456.0174 1460.9820 1467.9602 1472.4172 1485.2658 1491.2128 1569.9061 1607.1220 2981.1855 2990.1726 2993.9288 2997.5324 3001.2288 3032.4701 3039.8408 3062.2721 3082.9518 3085.4369 3103.7057 3107.4823 3117.6147 3139.2332 3142.6043 3157.4891 3174.4720 3479.4049 3562.7064
redmass: 5.7025 7.6514 9.0015 4.0928 9.4417 8.0907 3.5235 7.1440 2.4865 9.3529 2.4288 7.4235 6.4313 5.2495 5.8447 2.7369 3.6899 3.9209 6.2363 2.3125 6.5401 3.9889 2.7909 7.4005 2.9810 5.9275 5.3272 1.8813 11.4560 3.5287 1.7850 2.3770 2.1954 2.0130 3.4867 3.6858 3.9680 9.6204 4.0433 5.3569 4.9630 12.1440 9.2149 4.7103 10.9919 8.9412 3.5789 4.1659 5.7208 8.6351 11.0094 6.7238 5.9606 2.4212 2.0674 1.2153 7.5445 3.1465 1.7686 1.5770 5.6574 3.7737 2.2408 8.9450 1.5730 1.4163 3.6376 5.4392 6.9353 1.3997 2.9575 5.4027 2.9209 5.8505 1.8249 2.1127 9.0759 1.8638 3.2197 1.9415 2.5711 3.4730 2.6602 1.8538 5.1363 2.8911 1.1609 2.3437 1.5125 1.3213 1.2291 1.3183 1.1484 1.3284 1.6561 1.2020 1.1811 1.5982 1.5491 1.2521 3.0455 1.1935 2.3332 1.0756 1.0809 1.1869 2.0374 1.0443 1.0474 1.0458 1.0485 5.9925 6.9132 1.0602 1.0369 1.0387 1.0614 1.0851 1.1009 1.0595 1.1005 1.0987 1.0981 1.1028 1.1020 1.0999 1.0888 1.0922 1.0911 1.0991 1.0662 1.0664
irintensity: 2.2884 1.1772 0.6833 0.5492 1.0443 0.3576 0.5443 1.4037 0.4416 2.1954 0.3288 0.7766 0.1106 2.4346 0.6298 2.0992 3.6682 7.0892 2.5376 1.4685 3.4994 16.5014 2.8203 1.3182 1.8275 7.5603 10.1799 4.3854 1.5225 26.6304 88.2878 69.8505 58.9738 48.0580 41.9792 3.7651 20.5935 2.7830 7.1518 0.9081 41.9054 1.1430 21.4936 26.2462 6.1889 1.0470 84.2590 17.9412 16.2123 26.3973 27.5566 7.5861 24.0546 28.5696 31.0645 3.6898 42.7644 61.4188 14.9360 2.5719 58.5833 43.8117 4.2909 61.4222 13.9149 11.5331 37.7960 13.4225 70.3496 2.7013 40.1330 20.9240 190.7392 53.1372 9.4259 6.3801 198.9540 4.2658 137.7395 43.7609 78.9291 36.5866 128.5399 10.7499 243.8775 39.2031 6.3387 10.8550 37.1865 18.5697 13.8897 9.6121 14.0485 9.0348 5.8492 3.3949 8.1624 19.8200 4.8383 12.8227 21.0936 39.4184 18.3034 13.2352 10.9042 14.8925 13.3865 3.0738 16.5417 12.8439 10.2098 7.0660 1.6944 17.3355 18.4231 28.9065 20.1666 25.2830 10.3346 1.0591 4.6161 55.4357 11.4374 3.0815 15.9995 24.9472 3.3201 7.1538 4.2126 8.2732 231.2992 14.5945
temp: 298.150 k
press: 1.00000 atm
elementType: 16 9 9 9 9 9 9 8 8 8 8 7 6 6 6 6 6 6 6 6 6 6 6 6 6 6 6 1 1 1 1 1 1 1 1 1 1 1 1 1 1 1 1 1 1 1
symmnumber: 1
zpe: 864509.6 jmol-1
zpe.correction: 0.329274 hartree
zpe.thermalcorrener: 0.358933 hartree
zpe.thermalcorrenthalpy: 0.359877 hartree
zpe.thermalcorrgfe: 0.266203 hartree
zpe.sumelectzpe: -1933.474604 hartree
zpe.sumelectthermal: -1933.444945 hartree
zpe.sumelectthermalent: -1933.444001 hartree
zpe.sumelectthermalfe: -1933.537675 hartree
dipole: 0.0916 -2.1762 -2.7321
dipole: 3.4941
quadrupole: -190.0489 -153.5616 -172.0498
quadrupole: 20.8763 -16.2562 1.9390
quadrupole: -18.1621 18.3252 -0.1630 20.8763 -16.2562 1.9390
hfenergy: -1933.8038783 hartree
pointgroup: C01 [X(C15H19F6N1O4S1)]
dipole: 0.0092772 -0.8307152 -1.0952732 debye
polarizability: 247.6047903|18.2699472|205.1027464|-20.7118774|6.6690983|184.8105851 unknown
InChI: InChI=1S/C15H19F6NO4S/c1-3-22(4-2)27(25,26)11-7-5-6-10(8-11)12(23)9-13(24,14(16,17)18)15(19,20)21/h5-8,12,23-24H,3-4,9H2,1-2H3
charge 0 multiplicity 1
46 atoms
S  3.503537 -0.176529 0.138391
F  -2.046831 2.482259 1.143504
F  -3.488111 2.530676 -0.586971
F  -4.187602 1.787653 1.438722
F  -4.753554 -0.94356 0.683304
F  -3.427574 -1.669773 -1.006567
F  -4.687887 0.187936 -1.27461
O  -1.72485 0.488472 -0.900793
O  -1.08151 -2.032371 2.729756
O  4.803385 -1.007552 -0.38642
O  3.378776 0.289628 1.703795
N  3.268314 1.19709 -1.105988
C  -2.670029 0.321214 0.185321
C  -2.08478 -0.327454 1.468455
C  -1.49032 -1.751654 1.339286
C  -0.294599 -1.852433 0.390981
C  -3.105755 1.78416 0.52708
C  -3.900223 -0.500036 -0.349117
C  1.952464 -1.202463 -0.228473
C  0.884874 -1.108099 0.669162
C  -0.326605 -2.692466 -0.752426
C  1.954358 -2.030113 -1.364577
C  4.574436 1.725797 -1.601321
C  2.152334 2.125847 -0.765298
C  0.791535 -2.7913 -1.616927
C  5.554053 2.341936 -0.575108
C  2.36454 3.195034 0.331991
H  -1.285162 0.335084 1.840807
H  -2.866995 -0.367801 2.245674
H  -2.267512 -2.473876 1.019395
H  0.973597 -0.489949 1.56995
H  -1.228497 -3.277572 -0.965404
H  4.29224 2.470559 -2.371582
H  5.077138 0.890295 -2.119235
H  1.276841 1.499957 -0.505749
H  1.89451 2.61265 -1.727153
H  2.835315 -2.083044 -2.011698
H  -1.146363 -0.319076 -0.960577
H  0.752306 -3.454159 -2.486862
H  -0.609967 -2.903781 2.761839
H  5.130329 3.212439 -0.050071
H  5.851053 1.589475 0.175982
H  6.470472 2.666548 -1.102128
H  2.700045 2.730872 1.274762
H  3.099166 3.958911 0.026164
H  1.40361 3.709669 0.518827
